{"text_format":"1","workbook":"xlsx","n_sheets":6,"sheets":["Gantt","Tools","TranslationTable","HideValues","Start","Introduction"],"not_rendered":{"charts":0,"images":43,"macros":1,"external_links":0,"defined_names":4,"comments":2,"pivot_tables":0},"unopened":[],"bounds":{"document_bytes":16777216,"sheet_cells":100000,"rows_first":2000,"rows_last":500,"rows_between":2000,"halvings":0,"cell_chars":16384,"cell_head_chars":4096},"cells_cut":0,"cells_raw":0,"read":"whole","date_system":"1900"}

{"sheet":"Gantt","index":0,"n_rows":41,"n_cols":578,"rows_kept":41,"cut":false,"hidden":true,"merged":[[39,12,39,15],[40,12,40,15],[38,12,38,15],[19,12,19,15],[20,12,20,15],[14,466,14,472],[14,473,14,479],[14,354,14,360],[14,361,14,367],[14,368,14,374],[14,375,14,381],[14,382,14,388],[14,389,14,395],[14,396,14,402],[14,403,14,409],[14,410,14,416],[14,417,14,423],[14,424,14,430],[14,431,14,437],[14,438,14,444],[14,445,14,451],[14,452,14,458],[14,459,14,465],[14,312,14,318],[14,319,14,325],[14,326,14,332],[14,333,14,339],[14,571,14,577],[14,480,14,486],[14,487,14,493],[14,494,14,500],[14,501,14,507],[14,508,14,514],[14,515,14,521],[14,522,14,528],[14,529,14,535],[14,536,14,542],[14,543,14,549],[14,550,14,556],[14,557,14,563],[14,564,14,570],[14,340,14,346],[14,347,14,353],[14,186,14,192],[14,193,14,199],[14,200,14,206],[14,207,14,213],[14,214,14,220],[14,221,14,227],[14,228,14,234],[14,235,14,241],[14,242,14,248],[14,249,14,255],[14,256,14,262],[14,263,14,269],[14,270,14,276],[14,277,14,283],[14,284,14,290],[14,291,14,297],[14,298,14,304],[14,305,14,311],[14,123,14,129],[14,130,14,136],[14,137,14,143],[14,144,14,150],[14,151,14,157],[14,158,14,164],[14,165,14,171],[14,172,14,178],[14,179,14,185],[14,60,14,66],[14,67,14,73],[14,74,14,80],[14,81,14,87],[14,88,14,94],[14,95,14,101],[14,102,14,108],[14,109,14,115],[14,116,14,122],[9,568,12,568],[9,569,12,569],[9,570,12,570],[9,571,12,571],[9,533,12,533],[9,534,12,534],[9,535,12,535],[9,536,12,536],[9,537,12,537],[9,538,12,538],[9,539,12,539],[9,540,12,540],[9,541,12,541],[9,542,12,542],[9,543,12,543],[9,544,12,544],[9,545,12,545],[9,546,12,546],[9,547,12,547],[9,548,12,548],[9,549,12,549],[9,572,12,572],[9,573,12,573],[9,574,12,574],[9,575,12,575],[9,576,12,576],[9,577,12,577],[9,550,12,550],[9,551,12,551],[9,552,12,552],[9,553,12,553],[9,554,12,554],[9,555,12,555],[9,556,12,556],[9,557,12,557],[9,558,12,558],[9,559,12,559],[9,560,12,560],[9,561,12,561],[9,562,12,562],[9,563,12,563],[9,564,12,564],[9,565,12,565],[9,566,12,566],[9,567,12,567],[9,516,12,516],[9,517,12,517],[9,518,12,518],[9,519,12,519],[9,520,12,520],[9,521,12,521],[9,522,12,522],[9,523,12,523],[9,524,12,524],[9,525,12,525],[9,526,12,526],[9,527,12,527],[9,528,12,528],[9,529,12,529],[9,530,12,530],[9,531,12,531],[9,532,12,532],[9,499,12,499],[9,500,12,500],[9,501,12,501],[9,502,12,502],[9,503,12,503],[9,504,12,504],[9,505,12,505],[9,506,12,506],[9,507,12,507],[9,508,12,508],[9,509,12,509],[9,510,12,510],[9,511,12,511],[9,512,12,512],[9,513,12,513],[9,514,12,514],[9,515,12,515],[9,482,12,482],[9,483,12,483],[9,484,12,484],[9,485,12,485],[9,486,12,486],[9,487,12,487],[9,488,12,488],[9,489,12,489],[9,490,12,490],[9,491,12,491],[9,492,12,492],[9,493,12,493],[9,494,12,494],[9,495,12,495],[9,496,12,496],[9,497,12,497],[9,498,12,498],[9,465,12,465],[9,466,12,466],[9,467,12,467],[9,468,12,468],[9,469,12,469],[9,470,12,470],[9,471,12,471],[9,472,12,472],[9,473,12,473],[9,474,12,474],[9,475,12,475],[9,476,12,476],[9,477,12,477],[9,478,12,478],[9,479,12,479],[9,480,12,480],[9,481,12,481],[9,448,12,448],[9,449,12,449],[9,450,12,450],[9,451,12,451],[9,452,12,452],[9,453,12,453],[9,454,12,454],[9,455,12,455],[9,456,12,456],[9,457,12,457],[9,458,12,458],[9,459,12,459],[9,460,12,460],[9,461,12,461],[9,462,12,462],[9,463,12,463],[9,464,12,464],[9,431,12,431],[9,432,12,432],[9,433,12,433],[9,434,12,434],[9,435,12,435],[9,436,12,436],[9,437,12,437],[9,438,12,438],[9,439,12,439],[9,440,12,440],[9,441,12,441],[9,442,12,442],[9,443,12,443],[9,444,12,444],[9,445,12,445],[9,446,12,446],[9,447,12,447],[9,414,12,414],[9,415,12,415],[9,416,12,416],[9,417,12,417],[9,418,12,418],[9,419,12,419],[9,420,12,420],[9,421,12,421],[9,422,12,422],[9,423,12,423],[9,424,12,424],[9,425,12,425],[9,426,12,426],[9,427,12,427],[9,428,12,428],[9,429,12,429],[9,430,12,430],[9,397,12,397],[9,398,12,398],[9,399,12,399],[9,400,12,400],[9,401,12,401],[9,402,12,402],[9,403,12,403],[9,404,12,404],[9,405,12,405],[9,406,12,406],[9,407,12,407],[9,408,12,408],[9,409,12,409],[9,410,12,410],[9,411,12,411],[9,412,12,412],[9,413,12,413],[9,380,12,380],[9,381,12,381],[9,382,12,382],[9,383,12,383],[9,384,12,384],[9,385,12,385],[9,386,12,386],[9,387,12,387],[9,388,12,388],[9,389,12,389],[9,390,12,390],[9,391,12,391],[9,392,12,392],[9,393,12,393],[9,394,12,394],[9,395,12,395],[9,396,12,396],[9,363,12,363],[9,364,12,364],[9,365,12,365],[9,366,12,366],[9,367,12,367],[9,368,12,368],[9,369,12,369],[9,370,12,370],[9,371,12,371],[9,372,12,372],[9,373,12,373],[9,374,12,374],[9,375,12,375],[9,376,12,376],[9,377,12,377],[9,378,12,378],[9,379,12,379],[9,346,12,346],[9,347,12,347],[9,348,12,348],[9,349,12,349],[9,350,12,350],[9,351,12,351],[9,352,12,352],[9,353,12,353],[9,354,12,354],[9,355,12,355],[9,356,12,356],[9,357,12,357],[9,358,12,358],[9,359,12,359],[9,360,12,360],[9,361,12,361],[9,362,12,362],[9,329,12,329],[9,330,12,330],[9,331,12,331],[9,332,12,332],[9,333,12,333],[9,334,12,334],[9,335,12,335],[9,336,12,336],[9,337,12,337],[9,338,12,338],[9,339,12,339],[9,340,12,340],[9,341,12,341],[9,342,12,342],[9,343,12,343],[9,344,12,344],[9,345,12,345],[9,312,12,312],[9,313,12,313],[9,314,12,314],[9,315,12,315],[9,316,12,316],[9,317,12,317],[9,318,12,318],[9,319,12,319],[9,320,12,320],[9,321,12,321],[9,322,12,322],[9,323,12,323],[9,324,12,324],[9,325,12,325],[9,326,12,326],[9,327,12,327],[9,328,12,328],[9,295,12,295],[9,296,12,296],[9,297,12,297],[9,298,12,298],[9,299,12,299],[9,300,12,300],[9,301,12,301],[9,302,12,302],[9,303,12,303],[9,304,12,304],[9,305,12,305],[9,306,12,306],[9,307,12,307],[9,308,12,308],[9,309,12,309],[9,310,12,310],[9,311,12,311],[9,278,12,278],[9,279,12,279],[9,280,12,280],[9,281,12,281],[9,282,12,282],[9,283,12,283],[9,284,12,284],[9,285,12,285],[9,286,12,286],[9,287,12,287],[9,288,12,288],[9,289,12,289],[9,290,12,290],[9,291,12,291],[9,292,12,292],[9,293,12,293],[9,294,12,294],[9,274,12,274],[9,275,12,275],[9,276,12,276],[9,277,12,277],[9,34,12,34],[9,35,12,35],[17,24,17,26],[9,45,12,45],[9,46,12,46],[9,36,12,36],[9,37,12,37],[9,38,12,38],[9,39,12,39],[9,57,12,57],[9,51,12,51],[9,48,12,48],[9,49,12,49],[9,47,12,47],[9,43,12,43],[9,74,12,74],[9,75,12,75],[9,64,12,64],[9,65,12,65],[9,66,12,66],[9,53,12,53],[9,54,12,54],[9,55,12,55],[9,56,12,56],[9,33,12,33],[14,32,14,38],[16,27,16,30],[17,29,17,30],[16,16,16,26],[16,31,17,31],[9,41,12,41],[9,42,12,42],[9,44,12,44],[9,50,12,50],[14,39,14,45],[14,46,14,52],[14,53,14,59],[13,24,13,26],[13,29,13,30],[14,29,14,30],[9,67,12,67],[9,68,12,68],[9,69,12,69],[9,58,12,58],[9,59,12,59],[9,60,12,60],[9,61,12,61],[9,62,12,62],[9,63,12,63],[9,70,12,70],[9,71,12,71],[9,72,12,72],[9,73,12,73],[9,76,12,76],[9,78,12,78],[9,79,12,79],[9,80,12,80],[9,77,12,77],[9,81,12,81],[9,107,12,107],[9,108,12,108],[9,109,12,109],[9,88,12,88],[9,89,12,89],[9,90,12,90],[9,91,12,91],[9,92,12,92],[9,93,12,93],[9,82,12,82],[9,83,12,83],[9,84,12,84],[9,85,12,85],[9,86,12,86],[9,87,12,87],[9,110,12,110],[9,111,12,111],[9,100,12,100],[9,101,12,101],[9,103,12,103],[9,104,12,104],[9,105,12,105],[9,102,12,102],[9,94,12,94],[9,95,12,95],[9,96,12,96],[9,97,12,97],[9,98,12,98],[9,99,12,99],[9,106,12,106],[9,151,12,151],[9,152,12,152],[9,139,12,139],[9,140,12,140],[9,141,12,141],[9,142,12,142],[9,143,12,143],[9,144,12,144],[9,126,12,126],[9,134,12,134],[9,135,12,135],[9,136,12,136],[9,137,12,137],[9,138,12,138],[9,147,12,147],[9,148,12,148],[9,149,12,149],[9,150,12,150],[9,118,12,118],[9,119,12,119],[9,120,12,120],[9,121,12,121],[9,122,12,122],[9,123,12,123],[9,124,12,124],[9,125,12,125],[9,133,12,133],[9,157,12,157],[9,158,12,158],[9,159,12,159],[9,160,12,160],[9,161,12,161],[9,162,12,162],[9,112,12,112],[9,113,12,113],[9,114,12,114],[9,115,12,115],[9,116,12,116],[9,117,12,117],[9,127,12,127],[9,128,12,128],[9,129,12,129],[9,130,12,130],[9,131,12,131],[9,132,12,132],[9,153,12,153],[9,154,12,154],[9,155,12,155],[9,156,12,156],[9,145,12,145],[9,146,12,146],[9,163,12,163],[9,164,12,164],[9,165,12,165],[9,187,12,187],[9,188,12,188],[9,189,12,189],[9,175,12,175],[9,176,12,176],[9,177,12,177],[9,178,12,178],[9,179,12,179],[9,180,12,180],[9,166,12,166],[9,167,12,167],[9,168,12,168],[9,169,12,169],[9,170,12,170],[9,171,12,171],[9,172,12,172],[9,173,12,173],[9,174,12,174],[9,190,12,190],[9,191,12,191],[9,192,12,192],[9,181,12,181],[9,182,12,182],[9,183,12,183],[9,184,12,184],[9,185,12,185],[9,186,12,186],[9,193,12,193],[9,194,12,194],[9,195,12,195],[9,196,12,196],[9,197,12,197],[9,198,12,198],[9,199,12,199],[9,200,12,200],[9,201,12,201],[9,226,12,226],[9,227,12,227],[9,228,12,228],[9,217,12,217],[9,218,12,218],[9,219,12,219],[9,220,12,220],[9,221,12,221],[9,222,12,222],[9,223,12,223],[9,224,12,224],[9,225,12,225],[9,211,12,211],[9,212,12,212],[9,213,12,213],[9,214,12,214],[9,215,12,215],[9,216,12,216],[9,202,12,202],[9,203,12,203],[9,204,12,204],[9,205,12,205],[9,206,12,206],[9,207,12,207],[9,208,12,208],[9,209,12,209],[9,210,12,210],[9,259,12,259],[9,260,12,260],[9,261,12,261],[9,262,12,262],[9,263,12,263],[9,264,12,264],[9,253,12,253],[9,254,12,254],[9,255,12,255],[9,256,12,256],[9,257,12,257],[9,258,12,258],[9,271,12,271],[9,272,12,272],[9,273,12,273],[9,265,12,265],[9,266,12,266],[9,267,12,267],[9,268,12,268],[9,269,12,269],[9,270,12,270],[9,235,12,235],[9,236,12,236],[9,237,12,237],[9,238,12,238],[9,239,12,239],[9,240,12,240],[9,229,12,229],[9,230,12,230],[9,231,12,231],[9,232,12,232],[9,233,12,233],[9,234,12,234],[9,249,12,249],[9,250,12,250],[9,251,12,251],[9,252,12,252],[9,241,12,241],[9,242,12,242],[9,243,12,243],[9,244,12,244],[9,245,12,245],[9,246,12,246],[9,247,12,247],[9,248,12,248],[16,11,17,11],[37,12,37,15],[9,52,12,52],[35,12,35,15],[21,12,21,15],[17,12,17,15],[9,40,12,40],[24,12,24,15],[32,12,32,15],[33,12,33,15],[22,12,22,15],[23,12,23,15],[9,32,12,32],[25,12,25,15],[26,12,26,15],[27,12,27,15],[28,12,28,15],[29,12,29,15],[30,12,30,15],[31,12,31,15],[34,12,34,15],[36,12,36,15],[14,24,14,26],[18,12,18,15]]}
[null,"bouskoura232"]
[]
[]
[]
[]
[]
[null,null,null,null,null,null,null,null,null,null,null,null,null,null,null,null,null,null,null,null,null,null,null,null,null,null,null,null,null,null,null,null,{"$f":"HideValues!D3*1","v":"2016-11-15"},{"$f":"MAX(V22:V38)","v":"2016-12-01"},null,1,2,3,null,{"$f":"IF(Tools!D11<>\"\",Tools!D11,\"\")","v":"Gibs"},{"$f":"IF(Tools!D12<>\"\",Tools!D12,\"\")","v":"Sara"},{"$f":"IF(Tools!D13<>\"\",Tools!D13,\"\")","v":"Mary"},{"$f":"IF(Tools!D14<>\"\",Tools!D14,\"\")","v":"Jade"},{"$f":"IF(Tools!D15<>\"\",Tools!D15,\"\")","v":"Reda"},{"$f":"IF(Tools!D16<>\"\",Tools!D16,\"\")","v":"Mike"},{"$f":"IF(Tools!D17<>\"\",Tools!D17,\"\")","v":"Tony"},{"$f":"IF(Tools!D18<>\"\",Tools!D18,\"\")","v":"Leo"},{"$f":"IF(Tools!D19<>\"\",Tools!D19,\"\")","v":""},{"$f":"IF(Tools!D20<>\"\",Tools!D20,\"\")","v":""},{"$f":"IF(Tools!D21<>\"\",Tools!D21,\"\")","v":""},{"$f":"IF(Tools!D22<>\"\",Tools!D22,\"\")","v":""},{"$f":"IF(Tools!D23<>\"\",Tools!D23,\"\")","v":""},{"$f":"IF(Tools!D24<>\"\",Tools!D24,\"\")","v":""},{"$f":"IF(Tools!D25<>\"\",Tools!D25,\"\")","v":""},{"$f":"IF(Tools!D26<>\"\",Tools!D26,\"\")","v":""},{"$f":"IF(Tools!D27<>\"\",Tools!D27,\"\")","v":""},{"$f":"IF(Tools!D28<>\"\",Tools!D28,\"\")","v":""},{"$f":"IF(Tools!D29<>\"\",Tools!D29,\"\")","v":""},{"$f":"IF(Tools!D30<>\"\",Tools!D30,\"\")","v":""},{"$f":"IF(Tools!D31<>\"\",Tools!D31,\"\")","v":""},{"$f":"IF(Tools!D32<>\"\",Tools!D32,\"\")","v":""},{"$f":"IF(Tools!D33<>\"\",Tools!D33,\"\")","v":""},{"$f":"IF(Tools!D34<>\"\",Tools!D34,\"\")","v":""},{"$f":"IF(Tools!D35<>\"\",Tools!D35,\"\")","v":""},{"$f":"IF(Tools!D36<>\"\",Tools!D36,\"\")","v":""},{"$f":"IF(Tools!D37<>\"\",Tools!D37,\"\")","v":""},{"$f":"IF(Tools!D38<>\"\",Tools!D38,\"\")","v":""},{"$f":"IF(Tools!D39<>\"\",Tools!D39,\"\")","v":""},{"$f":"IF(Tools!D40<>\"\",Tools!D40,\"\")","v":""},{"$f":"IF(Tools!D41<>\"\",Tools!D41,\"\")","v":""},{"$f":"IF(Tools!D42<>\"\",Tools!D42,\"\")","v":""},{"$f":"IF(Tools!D43<>\"\",Tools!D43,\"\")","v":""},{"$f":"IF(Tools!D44<>\"\",Tools!D44,\"\")","v":""},{"$f":"IF(Tools!D45<>\"\",Tools!D45,\"\")","v":""},{"$f":"IF(Tools!D46<>\"\",Tools!D46,\"\")","v":""},{"$f":"IF(Tools!D47<>\"\",Tools!D47,\"\")","v":""},{"$f":"IF(Tools!D48<>\"\",Tools!D48,\"\")","v":""},{"$f":"IF(Tools!D49<>\"\",Tools!D49,\"\")","v":""},{"$f":"IF(Tools!D50<>\"\",Tools!D50,\"\")","v":""},{"$f":"IF(Tools!D51<>\"\",Tools!D51,\"\")","v":""},{"$f":"IF(Tools!D52<>\"\",Tools!D52,\"\")","v":""},{"$f":"IF(Tools!D53<>\"\",Tools!D53,\"\")","v":""},{"$f":"IF(Tools!D54<>\"\",Tools!D54,\"\")","v":""},{"$f":"IF(Tools!D55<>\"\",Tools!D55,\"\")","v":""},{"$f":"IF(Tools!D56<>\"\",Tools!D56,\"\")","v":""},{"$f":"IF(Tools!D57<>\"\",Tools!D57,\"\")","v":""},null,null,{"$f":"IF(HideValues!A83<>\"\",HideValues!A83,\"\")","v":"1- Après précédente"},{"$f":"IF(HideValues!B83<>\"\",HideValues!B83,\"\")","v":"2- Avec précédente"},{"$f":"IF(HideValues!C83<>\"\",HideValues!C83,\"\")","v":"3- Saisie manuelle"},{"$f":"IF(HideValues!D83<>\"\",HideValues!D83,\"\")","v":""},{"$f":"IF(HideValues!E83<>\"\",HideValues!E83,\"\")","v":"Aide"},{"$f":"IF(HideValues!F83<>\"\",HideValues!F83,\"\")","v":""},{"$f":"IF(HideValues!G83<>\"\",HideValues!G83,\"\")","v":""},{"$f":"IF(HideValues!H83<>\"\",HideValues!H83,\"\")","v":""},{"$f":"IF(HideValues!I83<>\"\",HideValues!I83,\"\")","v":""},{"$f":"IF(HideValues!J83<>\"\",HideValues!J83,\"\")","v":""}]
[null,null,null,null,null,null,null,null,null,null,null,null,null,null,null,null,null,null,null,null,null,null,null,null,null,null,null,null,null,null,null,null,{"$f":"IF(HideValues!$B$48,NETWORKDAYS(AG9,AG9,Tools!$B$10:$B$55),1)","v":1},{"$f":"IF(HideValues!$B$48,NETWORKDAYS(AH9,AH9,Tools!$B$10:$B$55),1)","v":1},{"$f":"IF(HideValues!$B$48,NETWORKDAYS(AI9,AI9,Tools!$B$10:$B$55),1)","v":1},{"$f":"IF(HideValues!$B$48,NETWORKDAYS(AJ9,AJ9,Tools!$B$10:$B$55),1)","v":1},{"$f":"IF(HideValues!$B$48,NETWORKDAYS(AK9,AK9,Tools!$B$10:$B$55),1)","v":0},{"$f":"IF(HideValues!$B$48,NETWORKDAYS(AL9,AL9,Tools!$B$10:$B$55),1)","v":0},{"$f":"IF(HideValues!$B$48,NETWORKDAYS(AM9,AM9,Tools!$B$10:$B$55),1)","v":1},{"$f":"IF(HideValues!$B$48,NETWORKDAYS(AN9,AN9,Tools!$B$10:$B$55),1)","v":1},{"$f":"IF(HideValues!$B$48,NETWORKDAYS(AO9,AO9,Tools!$B$10:$B$55),1)","v":1},{"$f":"IF(HideValues!$B$48,NETWORKDAYS(AP9,AP9,Tools!$B$10:$B$55),1)","v":1},{"$f":"IF(HideValues!$B$48,NETWORKDAYS(AQ9,AQ9,Tools!$B$10:$B$55),1)","v":1},{"$f":"IF(HideValues!$B$48,NETWORKDAYS(AR9,AR9,Tools!$B$10:$B$55),1)","v":0},{"$f":"IF(HideValues!$B$48,NETWORKDAYS(AS9,AS9,Tools!$B$10:$B$55),1)","v":0},{"$f":"IF(HideValues!$B$48,NETWORKDAYS(AT9,AT9,Tools!$B$10:$B$55),1)","v":1},{"$f":"IF(HideValues!$B$48,NETWORKDAYS(AU9,AU9,Tools!$B$10:$B$55),1)","v":1},{"$f":"IF(HideValues!$B$48,NETWORKDAYS(AV9,AV9,Tools!$B$10:$B$55),1)","v":1},{"$f":"IF(HideValues!$B$48,NETWORKDAYS(AW9,AW9,Tools!$B$10:$B$55),1)","v":1},{"$f":"IF(HideValues!$B$48,NETWORKDAYS(AX9,AX9,Tools!$B$10:$B$55),1)","v":1},{"$f":"IF(HideValues!$B$48,NETWORKDAYS(AY9,AY9,Tools!$B$10:$B$55),1)","v":0},{"$f":"IF(HideValues!$B$48,NETWORKDAYS(AZ9,AZ9,Tools!$B$10:$B$55),1)","v":0},{"$f":"IF(HideValues!$B$48,NETWORKDAYS(BA9,BA9,Tools!$B$10:$B$55),1)","v":1},{"$f":"IF(HideValues!$B$48,NETWORKDAYS(BB9,BB9,Tools!$B$10:$B$55),1)","v":1},{"$f":"IF(HideValues!$B$48,NETWORKDAYS(BC9,BC9,Tools!$B$10:$B$55),1)","v":1},{"$f":"IF(HideValues!$B$48,NETWORKDAYS(BD9,BD9,Tools!$B$10:$B$55),1)","v":1},{"$f":"IF(HideValues!$B$48,NETWORKDAYS(BE9,BE9,Tools!$B$10:$B$55),1)","v":1},{"$f":"IF(HideValues!$B$48,NETWORKDAYS(BF9,BF9,Tools!$B$10:$B$55),1)","v":0},{"$f":"IF(HideValues!$B$48,NETWORKDAYS(BG9,BG9,Tools!$B$10:$B$55),1)","v":0},{"$f":"IF(HideValues!$B$48,NETWORKDAYS(BH9,BH9,Tools!$B$10:$B$55),1)","v":1},{"$f":"IF(HideValues!$B$48,NETWORKDAYS(BI9,BI9,Tools!$B$10:$B$55),1)","v":1},{"$f":"IF(HideValues!$B$48,NETWORKDAYS(BJ9,BJ9,Tools!$B$10:$B$55),1)","v":1},{"$f":"IF(HideValues!$B$48,NETWORKDAYS(BK9,BK9,Tools!$B$10:$B$55),1)","v":1},{"$f":"IF(HideValues!$B$48,NETWORKDAYS(BL9,BL9,Tools!$B$10:$B$55),1)","v":1},{"$f":"IF(HideValues!$B$48,NETWORKDAYS(BM9,BM9,Tools!$B$10:$B$55),1)","v":0},{"$f":"IF(HideValues!$B$48,NETWORKDAYS(BN9,BN9,Tools!$B$10:$B$55),1)","v":0},{"$f":"IF(HideValues!$B$48,NETWORKDAYS(BO9,BO9,Tools!$B$10:$B$55),1)","v":1},{"$f":"IF(HideValues!$B$48,NETWORKDAYS(BP9,BP9,Tools!$B$10:$B$55),1)","v":1},{"$f":"IF(HideValues!$B$48,NETWORKDAYS(BQ9,BQ9,Tools!$B$10:$B$55),1)","v":1},{"$f":"IF(HideValues!$B$48,NETWORKDAYS(BR9,BR9,Tools!$B$10:$B$55),1)","v":1},{"$f":"IF(HideValues!$B$48,NETWORKDAYS(BS9,BS9,Tools!$B$10:$B$55),1)","v":1},{"$f":"IF(HideValues!$B$48,NETWORKDAYS(BT9,BT9,Tools!$B$10:$B$55),1)","v":0},{"$f":"IF(HideValues!$B$48,NETWORKDAYS(BU9,BU9,Tools!$B$10:$B$55),1)","v":0},{"$f":"IF(HideValues!$B$48,NETWORKDAYS(BV9,BV9,Tools!$B$10:$B$55),1)","v":1},{"$f":"IF(HideValues!$B$48,NETWORKDAYS(BW9,BW9,Tools!$B$10:$B$55),1)","v":1},{"$f":"IF(HideValues!$B$48,NETWORKDAYS(BX9,BX9,Tools!$B$10:$B$55),1)","v":1},{"$f":"IF(HideValues!$B$48,NETWORKDAYS(BY9,BY9,Tools!$B$10:$B$55),1)","v":1},{"$f":"IF(HideValues!$B$48,NETWORKDAYS(BZ9,BZ9,Tools!$B$10:$B$55),1)","v":1},{"$f":"IF(HideValues!$B$48,NETWORKDAYS(CA9,CA9,Tools!$B$10:$B$55),1)","v":0},{"$f":"IF(HideValues!$B$48,NETWORKDAYS(CB9,CB9,Tools!$B$10:$B$55),1)","v":0},{"$f":"IF(HideValues!$B$48,NETWORKDAYS(CC9,CC9,Tools!$B$10:$B$55),1)","v":1},{"$f":"IF(HideValues!$B$48,NETWORKDAYS(CD9,CD9,Tools!$B$10:$B$55),1)","v":1},{"$f":"IF(HideValues!$B$48,NETWORKDAYS(CE9,CE9,Tools!$B$10:$B$55),1)","v":1},{"$f":"IF(HideValues!$B$48,NETWORKDAYS(CF9,CF9,Tools!$B$10:$B$55),1)","v":1},{"$f":"IF(HideValues!$B$48,NETWORKDAYS(CG9,CG9,Tools!$B$10:$B$55),1)","v":1},{"$f":"IF(HideValues!$B$48,NETWORKDAYS(CH9,CH9,Tools!$B$10:$B$55),1)","v":0},{"$f":"IF(HideValues!$B$48,NETWORKDAYS(CI9,CI9,Tools!$B$10:$B$55),1)","v":0},{"$f":"IF(HideValues!$B$48,NETWORKDAYS(CJ9,CJ9,Tools!$B$10:$B$55),1)","v":1},{"$f":"IF(HideValues!$B$48,NETWORKDAYS(CK9,CK9,Tools!$B$10:$B$55),1)","v":1},{"$f":"IF(HideValues!$B$48,NETWORKDAYS(CL9,CL9,Tools!$B$10:$B$55),1)","v":1},{"$f":"IF(HideValues!$B$48,NETWORKDAYS(CM9,CM9,Tools!$B$10:$B$55),1)","v":1},{"$f":"IF(HideValues!$B$48,NETWORKDAYS(CN9,CN9,Tools!$B$10:$B$55),1)","v":1},{"$f":"IF(HideValues!$B$48,NETWORKDAYS(CO9,CO9,Tools!$B$10:$B$55),1)","v":0},{"$f":"IF(HideValues!$B$48,NETWORKDAYS(CP9,CP9,Tools!$B$10:$B$55),1)","v":0},{"$f":"IF(HideValues!$B$48,NETWORKDAYS(CQ9,CQ9,Tools!$B$10:$B$55),1)","v":1},{"$f":"IF(HideValues!$B$48,NETWORKDAYS(CR9,CR9,Tools!$B$10:$B$55),1)","v":1},{"$f":"IF(HideValues!$B$48,NETWORKDAYS(CS9,CS9,Tools!$B$10:$B$55),1)","v":1},{"$f":"IF(HideValues!$B$48,NETWORKDAYS(CT9,CT9,Tools!$B$10:$B$55),1)","v":1},{"$f":"IF(HideValues!$B$48,NETWORKDAYS(CU9,CU9,Tools!$B$10:$B$55),1)","v":1},{"$f":"IF(HideValues!$B$48,NETWORKDAYS(CV9,CV9,Tools!$B$10:$B$55),1)","v":0},{"$f":"IF(HideValues!$B$48,NETWORKDAYS(CW9,CW9,Tools!$B$10:$B$55),1)","v":0},{"$f":"IF(HideValues!$B$48,NETWORKDAYS(CX9,CX9,Tools!$B$10:$B$55),1)","v":1},{"$f":"IF(HideValues!$B$48,NETWORKDAYS(CY9,CY9,Tools!$B$10:$B$55),1)","v":1},{"$f":"IF(HideValues!$B$48,NETWORKDAYS(CZ9,CZ9,Tools!$B$10:$B$55),1)","v":1},{"$f":"IF(HideValues!$B$48,NETWORKDAYS(DA9,DA9,Tools!$B$10:$B$55),1)","v":1},{"$f":"IF(HideValues!$B$48,NETWORKDAYS(DB9,DB9,Tools!$B$10:$B$55),1)","v":1},{"$f":"IF(HideValues!$B$48,NETWORKDAYS(DC9,DC9,Tools!$B$10:$B$55),1)","v":0},{"$f":"IF(HideValues!$B$48,NETWORKDAYS(DD9,DD9,Tools!$B$10:$B$55),1)","v":0},{"$f":"IF(HideValues!$B$48,NETWORKDAYS(DE9,DE9,Tools!$B$10:$B$55),1)","v":1},{"$f":"IF(HideValues!$B$48,NETWORKDAYS(DF9,DF9,Tools!$B$10:$B$55),1)","v":1},{"$f":"IF(HideValues!$B$48,NETWORKDAYS(DG9,DG9,Tools!$B$10:$B$55),1)","v":1},{"$f":"IF(HideValues!$B$48,NETWORKDAYS(DH9,DH9,Tools!$B$10:$B$55),1)","v":1},{"$f":"IF(HideValues!$B$48,NETWORKDAYS(DI9,DI9,Tools!$B$10:$B$55),1)","v":1},{"$f":"IF(HideValues!$B$48,NETWORKDAYS(DJ9,DJ9,Tools!$B$10:$B$55),1)","v":0},{"$f":"IF(HideValues!$B$48,NETWORKDAYS(DK9,DK9,Tools!$B$10:$B$55),1)","v":0},{"$f":"IF(HideValues!$B$48,NETWORKDAYS(DL9,DL9,Tools!$B$10:$B$55),1)","v":1},{"$f":"IF(HideValues!$B$48,NETWORKDAYS(DM9,DM9,Tools!$B$10:$B$55),1)","v":1},{"$f":"IF(HideValues!$B$48,NETWORKDAYS(DN9,DN9,Tools!$B$10:$B$55),1)","v":1},{"$f":"IF(HideValues!$B$48,NETWORKDAYS(DO9,DO9,Tools!$B$10:$B$55),1)","v":1},{"$f":"IF(HideValues!$B$48,NETWORKDAYS(DP9,DP9,Tools!$B$10:$B$55),1)","v":1},{"$f":"IF(HideValues!$B$48,NETWORKDAYS(DQ9,DQ9,Tools!$B$10:$B$55),1)","v":0},{"$f":"IF(HideValues!$B$48,NETWORKDAYS(DR9,DR9,Tools!$B$10:$B$55),1)","v":0},{"$f":"IF(HideValues!$B$48,NETWORKDAYS(DS9,DS9,Tools!$B$10:$B$55),1)","v":1},{"$f":"IF(HideValues!$B$48,NETWORKDAYS(DT9,DT9,Tools!$B$10:$B$55),1)","v":1},{"$f":"IF(HideValues!$B$48,NETWORKDAYS(DU9,DU9,Tools!$B$10:$B$55),1)","v":1},{"$f":"IF(HideValues!$B$48,NETWORKDAYS(DV9,DV9,Tools!$B$10:$B$55),1)","v":1},{"$f":"IF(HideValues!$B$48,NETWORKDAYS(DW9,DW9,Tools!$B$10:$B$55),1)","v":1},{"$f":"IF(HideValues!$B$48,NETWORKDAYS(DX9,DX9,Tools!$B$10:$B$55),1)","v":0},{"$f":"IF(HideValues!$B$48,NETWORKDAYS(DY9,DY9,Tools!$B$10:$B$55),1)","v":0},{"$f":"IF(HideValues!$B$48,NETWORKDAYS(DZ9,DZ9,Tools!$B$10:$B$55),1)","v":1},{"$f":"IF(HideValues!$B$48,NETWORKDAYS(EA9,EA9,Tools!$B$10:$B$55),1)","v":1},{"$f":"IF(HideValues!$B$48,NETWORKDAYS(EB9,EB9,Tools!$B$10:$B$55),1)","v":1},{"$f":"IF(HideValues!$B$48,NETWORKDAYS(EC9,EC9,Tools!$B$10:$B$55),1)","v":1},{"$f":"IF(HideValues!$B$48,NETWORKDAYS(ED9,ED9,Tools!$B$10:$B$55),1)","v":1},{"$f":"IF(HideValues!$B$48,NETWORKDAYS(EE9,EE9,Tools!$B$10:$B$55),1)","v":0},{"$f":"IF(HideValues!$B$48,NETWORKDAYS(EF9,EF9,Tools!$B$10:$B$55),1)","v":0},{"$f":"IF(HideValues!$B$48,NETWORKDAYS(EG9,EG9,Tools!$B$10:$B$55),1)","v":1},{"$f":"IF(HideValues!$B$48,NETWORKDAYS(EH9,EH9,Tools!$B$10:$B$55),1)","v":1},{"$f":"IF(HideValues!$B$48,NETWORKDAYS(EI9,EI9,Tools!$B$10:$B$55),1)","v":1},{"$f":"IF(HideValues!$B$48,NETWORKDAYS(EJ9,EJ9,Tools!$B$10:$B$55),1)","v":1},{"$f":"IF(HideValues!$B$48,NETWORKDAYS(EK9,EK9,Tools!$B$10:$B$55),1)","v":1},{"$f":"IF(HideValues!$B$48,NETWORKDAYS(EL9,EL9,Tools!$B$10:$B$55),1)","v":0},{"$f":"IF(HideValues!$B$48,NETWORKDAYS(EM9,EM9,Tools!$B$10:$B$55),1)","v":0},{"$f":"IF(HideValues!$B$48,NETWORKDAYS(EN9,EN9,Tools!$B$10:$B$55),1)","v":1},{"$f":"IF(HideValues!$B$48,NETWORKDAYS(EO9,EO9,Tools!$B$10:$B$55),1)","v":1},{"$f":"IF(HideValues!$B$48,NETWORKDAYS(EP9,EP9,Tools!$B$10:$B$55),1)","v":1},{"$f":"IF(HideValues!$B$48,NETWORKDAYS(EQ9,EQ9,Tools!$B$10:$B$55),1)","v":1},{"$f":"IF(HideValues!$B$48,NETWORKDAYS(ER9,ER9,Tools!$B$10:$B$55),1)","v":1},{"$f":"IF(HideValues!$B$48,NETWORKDAYS(ES9,ES9,Tools!$B$10:$B$55),1)","v":0},{"$f":"IF(HideValues!$B$48,NETWORKDAYS(ET9,ET9,Tools!$B$10:$B$55),1)","v":0},{"$f":"IF(HideValues!$B$48,NETWORKDAYS(EU9,EU9,Tools!$B$10:$B$55),1)","v":1},{"$f":"IF(HideValues!$B$48,NETWORKDAYS(EV9,EV9,Tools!$B$10:$B$55),1)","v":1},{"$f":"IF(HideValues!$B$48,NETWORKDAYS(EW9,EW9,Tools!$B$10:$B$55),1)","v":1},{"$f":"IF(HideValues!$B$48,NETWORKDAYS(EX9,EX9,Tools!$B$10:$B$55),1)","v":1},{"$f":"IF(HideValues!$B$48,NETWORKDAYS(EY9,EY9,Tools!$B$10:$B$55),1)","v":1},{"$f":"IF(HideValues!$B$48,NETWORKDAYS(EZ9,EZ9,Tools!$B$10:$B$55),1)","v":0},{"$f":"IF(HideValues!$B$48,NETWORKDAYS(FA9,FA9,Tools!$B$10:$B$55),1)","v":0},{"$f":"IF(HideValues!$B$48,NETWORKDAYS(FB9,FB9,Tools!$B$10:$B$55),1)","v":1},{"$f":"IF(HideValues!$B$48,NETWORKDAYS(FC9,FC9,Tools!$B$10:$B$55),1)","v":1},{"$f":"IF(HideValues!$B$48,NETWORKDAYS(FD9,FD9,Tools!$B$10:$B$55),1)","v":1},{"$f":"IF(HideValues!$B$48,NETWORKDAYS(FE9,FE9,Tools!$B$10:$B$55),1)","v":1},{"$f":"IF(HideValues!$B$48,NETWORKDAYS(FF9,FF9,Tools!$B$10:$B$55),1)","v":1},{"$f":"IF(HideValues!$B$48,NETWORKDAYS(FG9,FG9,Tools!$B$10:$B$55),1)","v":0},{"$f":"IF(HideValues!$B$48,NETWORKDAYS(FH9,FH9,Tools!$B$10:$B$55),1)","v":0},{"$f":"IF(HideValues!$B$48,NETWORKDAYS(FI9,FI9,Tools!$B$10:$B$55),1)","v":1},{"$f":"IF(HideValues!$B$48,NETWORKDAYS(FJ9,FJ9,Tools!$B$10:$B$55),1)","v":1},{"$f":"IF(HideValues!$B$48,NETWORKDAYS(FK9,FK9,Tools!$B$10:$B$55),1)","v":1},{"$f":"IF(HideValues!$B$48,NETWORKDAYS(FL9,FL9,Tools!$B$10:$B$55),1)","v":1},{"$f":"IF(HideValues!$B$48,NETWORKDAYS(FM9,FM9,Tools!$B$10:$B$55),1)","v":1},{"$f":"IF(HideValues!$B$48,NETWORKDAYS(FN9,FN9,Tools!$B$10:$B$55),1)","v":0},{"$f":"IF(HideValues!$B$48,NETWORKDAYS(FO9,FO9,Tools!$B$10:$B$55),1)","v":0},{"$f":"IF(HideValues!$B$48,NETWORKDAYS(FP9,FP9,Tools!$B$10:$B$55),1)","v":1},{"$f":"IF(HideValues!$B$48,NETWORKDAYS(FQ9,FQ9,Tools!$B$10:$B$55),1)","v":1},{"$f":"IF(HideValues!$B$48,NETWORKDAYS(FR9,FR9,Tools!$B$10:$B$55),1)","v":1},{"$f":"IF(HideValues!$B$48,NETWORKDAYS(FS9,FS9,Tools!$B$10:$B$55),1)","v":1},{"$f":"IF(HideValues!$B$48,NETWORKDAYS(FT9,FT9,Tools!$B$10:$B$55),1)","v":1},{"$f":"IF(HideValues!$B$48,NETWORKDAYS(FU9,FU9,Tools!$B$10:$B$55),1)","v":0},{"$f":"IF(HideValues!$B$48,NETWORKDAYS(FV9,FV9,Tools!$B$10:$B$55),1)","v":0},{"$f":"IF(HideValues!$B$48,NETWORKDAYS(FW9,FW9,Tools!$B$10:$B$55),1)","v":1},{"$f":"IF(HideValues!$B$48,NETWORKDAYS(FX9,FX9,Tools!$B$10:$B$55),1)","v":1},{"$f":"IF(HideValues!$B$48,NETWORKDAYS(FY9,FY9,Tools!$B$10:$B$55),1)","v":1},{"$f":"IF(HideValues!$B$48,NETWORKDAYS(FZ9,FZ9,Tools!$B$10:$B$55),1)","v":1},{"$f":"IF(HideValues!$B$48,NETWORKDAYS(GA9,GA9,Tools!$B$10:$B$55),1)","v":1},{"$f":"IF(HideValues!$B$48,NETWORKDAYS(GB9,GB9,Tools!$B$10:$B$55),1)","v":0},{"$f":"IF(HideValues!$B$48,NETWORKDAYS(GC9,GC9,Tools!$B$10:$B$55),1)","v":0},{"$f":"IF(HideValues!$B$48,NETWORKDAYS(GD9,GD9,Tools!$B$10:$B$55),1)","v":1},{"$f":"IF(HideValues!$B$48,NETWORKDAYS(GE9,GE9,Tools!$B$10:$B$55),1)","v":1},{"$f":"IF(HideValues!$B$48,NETWORKDAYS(GF9,GF9,Tools!$B$10:$B$55),1)","v":1},{"$f":"IF(HideValues!$B$48,NETWORKDAYS(GG9,GG9,Tools!$B$10:$B$55),1)","v":1},{"$f":"IF(HideValues!$B$48,NETWORKDAYS(GH9,GH9,Tools!$B$10:$B$55),1)","v":1},{"$f":"IF(HideValues!$B$48,NETWORKDAYS(GI9,GI9,Tools!$B$10:$B$55),1)","v":0},{"$f":"IF(HideValues!$B$48,NETWORKDAYS(GJ9,GJ9,Tools!$B$10:$B$55),1)","v":0},{"$f":"IF(HideValues!$B$48,NETWORKDAYS(GK9,GK9,Tools!$B$10:$B$55),1)","v":1},{"$f":"IF(HideValues!$B$48,NETWORKDAYS(GL9,GL9,Tools!$B$10:$B$55),1)","v":1},{"$f":"IF(HideValues!$B$48,NETWORKDAYS(GM9,GM9,Tools!$B$10:$B$55),1)","v":1},{"$f":"IF(HideValues!$B$48,NETWORKDAYS(GN9,GN9,Tools!$B$10:$B$55),1)","v":1},{"$f":"IF(HideValues!$B$48,NETWORKDAYS(GO9,GO9,Tools!$B$10:$B$55),1)","v":1},{"$f":"IF(HideValues!$B$48,NETWORKDAYS(GP9,GP9,Tools!$B$10:$B$55),1)","v":0},{"$f":"IF(HideValues!$B$48,NETWORKDAYS(GQ9,GQ9,Tools!$B$10:$B$55),1)","v":0},{"$f":"IF(HideValues!$B$48,NETWORKDAYS(GR9,GR9,Tools!$B$10:$B$55),1)","v":1},{"$f":"IF(HideValues!$B$48,NETWORKDAYS(GS9,GS9,Tools!$B$10:$B$55),1)","v":1},{"$f":"IF(HideValues!$B$48,NETWORKDAYS(GT9,GT9,Tools!$B$10:$B$55),1)","v":1},{"$f":"IF(HideValues!$B$48,NETWORKDAYS(GU9,GU9,Tools!$B$10:$B$55),1)","v":1},{"$f":"IF(HideValues!$B$48,NETWORKDAYS(GV9,GV9,Tools!$B$10:$B$55),1)","v":1},{"$f":"IF(HideValues!$B$48,NETWORKDAYS(GW9,GW9,Tools!$B$10:$B$55),1)","v":0},{"$f":"IF(HideValues!$B$48,NETWORKDAYS(GX9,GX9,Tools!$B$10:$B$55),1)","v":0},{"$f":"IF(HideValues!$B$48,NETWORKDAYS(GY9,GY9,Tools!$B$10:$B$55),1)","v":1},{"$f":"IF(HideValues!$B$48,NETWORKDAYS(GZ9,GZ9,Tools!$B$10:$B$55),1)","v":1},{"$f":"IF(HideValues!$B$48,NETWORKDAYS(HA9,HA9,Tools!$B$10:$B$55),1)","v":1},{"$f":"IF(HideValues!$B$48,NETWORKDAYS(HB9,HB9,Tools!$B$10:$B$55),1)","v":1},{"$f":"IF(HideValues!$B$48,NETWORKDAYS(HC9,HC9,Tools!$B$10:$B$55),1)","v":1},{"$f":"IF(HideValues!$B$48,NETWORKDAYS(HD9,HD9,Tools!$B$10:$B$55),1)","v":0},{"$f":"IF(HideValues!$B$48,NETWORKDAYS(HE9,HE9,Tools!$B$10:$B$55),1)","v":0},{"$f":"IF(HideValues!$B$48,NETWORKDAYS(HF9,HF9,Tools!$B$10:$B$55),1)","v":1},{"$f":"IF(HideValues!$B$48,NETWORKDAYS(HG9,HG9,Tools!$B$10:$B$55),1)","v":1},{"$f":"IF(HideValues!$B$48,NETWORKDAYS(HH9,HH9,Tools!$B$10:$B$55),1)","v":1},{"$f":"IF(HideValues!$B$48,NETWORKDAYS(HI9,HI9,Tools!$B$10:$B$55),1)","v":1},{"$f":"IF(HideValues!$B$48,NETWORKDAYS(HJ9,HJ9,Tools!$B$10:$B$55),1)","v":1},{"$f":"IF(HideValues!$B$48,NETWORKDAYS(HK9,HK9,Tools!$B$10:$B$55),1)","v":0},{"$f":"IF(HideValues!$B$48,NETWORKDAYS(HL9,HL9,Tools!$B$10:$B$55),1)","v":0},{"$f":"IF(HideValues!$B$48,NETWORKDAYS(HM9,HM9,Tools!$B$10:$B$55),1)","v":1},{"$f":"IF(HideValues!$B$48,NETWORKDAYS(HN9,HN9,Tools!$B$10:$B$55),1)","v":1},{"$f":"IF(HideValues!$B$48,NETWORKDAYS(HO9,HO9,Tools!$B$10:$B$55),1)","v":1},{"$f":"IF(HideValues!$B$48,NETWORKDAYS(HP9,HP9,Tools!$B$10:$B$55),1)","v":1},{"$f":"IF(HideValues!$B$48,NETWORKDAYS(HQ9,HQ9,Tools!$B$10:$B$55),1)","v":1},{"$f":"IF(HideValues!$B$48,NETWORKDAYS(HR9,HR9,Tools!$B$10:$B$55),1)","v":0},{"$f":"IF(HideValues!$B$48,NETWORKDAYS(HS9,HS9,Tools!$B$10:$B$55),1)","v":0},{"$f":"IF(HideValues!$B$48,NETWORKDAYS(HT9,HT9,Tools!$B$10:$B$55),1)","v":1},{"$f":"IF(HideValues!$B$48,NETWORKDAYS(HU9,HU9,Tools!$B$10:$B$55),1)","v":1},{"$f":"IF(HideValues!$B$48,NETWORKDAYS(HV9,HV9,Tools!$B$10:$B$55),1)","v":1},{"$f":"IF(HideValues!$B$48,NETWORKDAYS(HW9,HW9,Tools!$B$10:$B$55),1)","v":1},{"$f":"IF(HideValues!$B$48,NETWORKDAYS(HX9,HX9,Tools!$B$10:$B$55),1)","v":1},{"$f":"IF(HideValues!$B$48,NETWORKDAYS(HY9,HY9,Tools!$B$10:$B$55),1)","v":0},{"$f":"IF(HideValues!$B$48,NETWORKDAYS(HZ9,HZ9,Tools!$B$10:$B$55),1)","v":0},{"$f":"IF(HideValues!$B$48,NETWORKDAYS(IA9,IA9,Tools!$B$10:$B$55),1)","v":1},{"$f":"IF(HideValues!$B$48,NETWORKDAYS(IB9,IB9,Tools!$B$10:$B$55),1)","v":1},{"$f":"IF(HideValues!$B$48,NETWORKDAYS(IC9,IC9,Tools!$B$10:$B$55),1)","v":1},{"$f":"IF(HideValues!$B$48,NETWORKDAYS(ID9,ID9,Tools!$B$10:$B$55),1)","v":1},{"$f":"IF(HideValues!$B$48,NETWORKDAYS(IE9,IE9,Tools!$B$10:$B$55),1)","v":1},{"$f":"IF(HideValues!$B$48,NETWORKDAYS(IF9,IF9,Tools!$B$10:$B$55),1)","v":0},{"$f":"IF(HideValues!$B$48,NETWORKDAYS(IG9,IG9,Tools!$B$10:$B$55),1)","v":0},{"$f":"IF(HideValues!$B$48,NETWORKDAYS(IH9,IH9,Tools!$B$10:$B$55),1)","v":1},{"$f":"IF(HideValues!$B$48,NETWORKDAYS(II9,II9,Tools!$B$10:$B$55),1)","v":1},{"$f":"IF(HideValues!$B$48,NETWORKDAYS(IJ9,IJ9,Tools!$B$10:$B$55),1)","v":1},{"$f":"IF(HideValues!$B$48,NETWORKDAYS(IK9,IK9,Tools!$B$10:$B$55),1)","v":1},{"$f":"IF(HideValues!$B$48,NETWORKDAYS(IL9,IL9,Tools!$B$10:$B$55),1)","v":1},{"$f":"IF(HideValues!$B$48,NETWORKDAYS(IM9,IM9,Tools!$B$10:$B$55),1)","v":0},{"$f":"IF(HideValues!$B$48,NETWORKDAYS(IN9,IN9,Tools!$B$10:$B$55),1)","v":0},{"$f":"IF(HideValues!$B$48,NETWORKDAYS(IO9,IO9,Tools!$B$10:$B$55),1)","v":1},{"$f":"IF(HideValues!$B$48,NETWORKDAYS(IP9,IP9,Tools!$B$10:$B$55),1)","v":1},{"$f":"IF(HideValues!$B$48,NETWORKDAYS(IQ9,IQ9,Tools!$B$10:$B$55),1)","v":1},{"$f":"IF(HideValues!$B$48,NETWORKDAYS(IR9,IR9,Tools!$B$10:$B$55),1)","v":1},{"$f":"IF(HideValues!$B$48,NETWORKDAYS(IS9,IS9,Tools!$B$10:$B$55),1)","v":1},{"$f":"IF(HideValues!$B$48,NETWORKDAYS(IT9,IT9,Tools!$B$10:$B$55),1)","v":0},{"$f":"IF(HideValues!$B$48,NETWORKDAYS(IU9,IU9,Tools!$B$10:$B$55),1)","v":0},{"$f":"IF(HideValues!$B$48,NETWORKDAYS(IV9,IV9,Tools!$B$10:$B$55),1)","v":1},{"$f":"IF(HideValues!$B$48,NETWORKDAYS(IW9,IW9,Tools!$B$10:$B$55),1)","v":1},{"$f":"IF(HideValues!$B$48,NETWORKDAYS(IX9,IX9,Tools!$B$10:$B$55),1)","v":1},{"$f":"IF(HideValues!$B$48,NETWORKDAYS(IY9,IY9,Tools!$B$10:$B$55),1)","v":1},{"$f":"IF(HideValues!$B$48,NETWORKDAYS(IZ9,IZ9,Tools!$B$10:$B$55),1)","v":1},{"$f":"IF(HideValues!$B$48,NETWORKDAYS(JA9,JA9,Tools!$B$10:$B$55),1)","v":0},{"$f":"IF(HideValues!$B$48,NETWORKDAYS(JB9,JB9,Tools!$B$10:$B$55),1)","v":0},{"$f":"IF(HideValues!$B$48,NETWORKDAYS(JC9,JC9,Tools!$B$10:$B$55),1)","v":1},{"$f":"IF(HideValues!$B$48,NETWORKDAYS(JD9,JD9,Tools!$B$10:$B$55),1)","v":1},{"$f":"IF(HideValues!$B$48,NETWORKDAYS(JE9,JE9,Tools!$B$10:$B$55),1)","v":1},{"$f":"IF(HideValues!$B$48,NETWORKDAYS(JF9,JF9,Tools!$B$10:$B$55),1)","v":1},{"$f":"IF(HideValues!$B$48,NETWORKDAYS(JG9,JG9,Tools!$B$10:$B$55),1)","v":1},{"$f":"IF(HideValues!$B$48,NETWORKDAYS(JH9,JH9,Tools!$B$10:$B$55),1)","v":0},{"$f":"IF(HideValues!$B$48,NETWORKDAYS(JI9,JI9,Tools!$B$10:$B$55),1)","v":0},{"$f":"IF(HideValues!$B$48,NETWORKDAYS(JJ9,JJ9,Tools!$B$10:$B$55),1)","v":1},{"$f":"IF(HideValues!$B$48,NETWORKDAYS(JK9,JK9,Tools!$B$10:$B$55),1)","v":1},{"$f":"IF(HideValues!$B$48,NETWORKDAYS(JL9,JL9,Tools!$B$10:$B$55),1)","v":1},{"$f":"IF(HideValues!$B$48,NETWORKDAYS(JM9,JM9,Tools!$B$10:$B$55),1)","v":1},{"$f":"IF(HideValues!$B$48,NETWORKDAYS(JN9,JN9,Tools!$B$10:$B$55),1)","v":1},{"$f":"IF(HideValues!$B$48,NETWORKDAYS(JO9,JO9,Tools!$B$10:$B$55),1)","v":0},{"$f":"IF(HideValues!$B$48,NETWORKDAYS(JP9,JP9,Tools!$B$10:$B$55),1)","v":0},{"$f":"IF(HideValues!$B$48,NETWORKDAYS(JQ9,JQ9,Tools!$B$10:$B$55),1)","v":1},{"$f":"IF(HideValues!$B$48,NETWORKDAYS(JR9,JR9,Tools!$B$10:$B$55),1)","v":1},{"$f":"IF(HideValues!$B$48,NETWORKDAYS(JS9,JS9,Tools!$B$10:$B$55),1)","v":1},{"$f":"IF(HideValues!$B$48,NETWORKDAYS(JT9,JT9,Tools!$B$10:$B$55),1)","v":1},{"$f":"IF(HideValues!$B$48,NETWORKDAYS(JU9,JU9,Tools!$B$10:$B$55),1)","v":1},{"$f":"IF(HideValues!$B$48,NETWORKDAYS(JV9,JV9,Tools!$B$10:$B$55),1)","v":0},{"$f":"IF(HideValues!$B$48,NETWORKDAYS(JW9,JW9,Tools!$B$10:$B$55),1)","v":0},{"$f":"IF(HideValues!$B$48,NETWORKDAYS(JX9,JX9,Tools!$B$10:$B$55),1)","v":1},{"$f":"IF(HideValues!$B$48,NETWORKDAYS(JY9,JY9,Tools!$B$10:$B$55),1)","v":1},{"$f":"IF(HideValues!$B$48,NETWORKDAYS(JZ9,JZ9,Tools!$B$10:$B$55),1)","v":1},{"$f":"IF(HideValues!$B$48,NETWORKDAYS(KA9,KA9,Tools!$B$10:$B$55),1)","v":1},{"$f":"IF(HideValues!$B$48,NETWORKDAYS(KB9,KB9,Tools!$B$10:$B$55),1)","v":1},{"$f":"IF(HideValues!$B$48,NETWORKDAYS(KC9,KC9,Tools!$B$10:$B$55),1)","v":0},{"$f":"IF(HideValues!$B$48,NETWORKDAYS(KD9,KD9,Tools!$B$10:$B$55),1)","v":0},{"$f":"IF(HideValues!$B$48,NETWORKDAYS(KE9,KE9,Tools!$B$10:$B$55),1)","v":1},{"$f":"IF(HideValues!$B$48,NETWORKDAYS(KF9,KF9,Tools!$B$10:$B$55),1)","v":1},{"$f":"IF(HideValues!$B$48,NETWORKDAYS(KG9,KG9,Tools!$B$10:$B$55),1)","v":1},{"$f":"IF(HideValues!$B$48,NETWORKDAYS(KH9,KH9,Tools!$B$10:$B$55),1)","v":1},{"$f":"IF(HideValues!$B$48,NETWORKDAYS(KI9,KI9,Tools!$B$10:$B$55),1)","v":1},{"$f":"IF(HideValues!$B$48,NETWORKDAYS(KJ9,KJ9,Tools!$B$10:$B$55),1)","v":0},{"$f":"IF(HideValues!$B$48,NETWORKDAYS(KK9,KK9,Tools!$B$10:$B$55),1)","v":0},{"$f":"IF(HideValues!$B$48,NETWORKDAYS(KL9,KL9,Tools!$B$10:$B$55),1)","v":1},{"$f":"IF(HideValues!$B$48,NETWORKDAYS(KM9,KM9,Tools!$B$10:$B$55),1)","v":1},{"$f":"IF(HideValues!$B$48,NETWORKDAYS(KN9,KN9,Tools!$B$10:$B$55),1)","v":1},{"$f":"IF(HideValues!$B$48,NETWORKDAYS(KO9,KO9,Tools!$B$10:$B$55),1)","v":1},{"$f":"IF(HideValues!$B$48,NETWORKDAYS(KP9,KP9,Tools!$B$10:$B$55),1)","v":1},{"$f":"IF(HideValues!$B$48,NETWORKDAYS(KQ9,KQ9,Tools!$B$10:$B$55),1)","v":0},{"$f":"IF(HideValues!$B$48,NETWORKDAYS(KR9,KR9,Tools!$B$10:$B$55),1)","v":0},{"$f":"IF(HideValues!$B$48,NETWORKDAYS(KS9,KS9,Tools!$B$10:$B$55),1)","v":1},{"$f":"IF(HideValues!$B$48,NETWORKDAYS(KT9,KT9,Tools!$B$10:$B$55),1)","v":1},{"$f":"IF(HideValues!$B$48,NETWORKDAYS(KU9,KU9,Tools!$B$10:$B$55),1)","v":1},{"$f":"IF(HideValues!$B$48,NETWORKDAYS(KV9,KV9,Tools!$B$10:$B$55),1)","v":1},{"$f":"IF(HideValues!$B$48,NETWORKDAYS(KW9,KW9,Tools!$B$10:$B$55),1)","v":1},{"$f":"IF(HideValues!$B$48,NETWORKDAYS(KX9,KX9,Tools!$B$10:$B$55),1)","v":0},{"$f":"IF(HideValues!$B$48,NETWORKDAYS(KY9,KY9,Tools!$B$10:$B$55),1)","v":0},{"$f":"IF(HideValues!$B$48,NETWORKDAYS(KZ9,KZ9,Tools!$B$10:$B$55),1)","v":1},{"$f":"IF(HideValues!$B$48,NETWORKDAYS(LA9,LA9,Tools!$B$10:$B$55),1)","v":1},{"$f":"IF(HideValues!$B$48,NETWORKDAYS(LB9,LB9,Tools!$B$10:$B$55),1)","v":1},{"$f":"IF(HideValues!$B$48,NETWORKDAYS(LC9,LC9,Tools!$B$10:$B$55),1)","v":1},{"$f":"IF(HideValues!$B$48,NETWORKDAYS(LD9,LD9,Tools!$B$10:$B$55),1)","v":1},{"$f":"IF(HideValues!$B$48,NETWORKDAYS(LE9,LE9,Tools!$B$10:$B$55),1)","v":0},{"$f":"IF(HideValues!$B$48,NETWORKDAYS(LF9,LF9,Tools!$B$10:$B$55),1)","v":0},{"$f":"IF(HideValues!$B$48,NETWORKDAYS(LG9,LG9,Tools!$B$10:$B$55),1)","v":1},{"$f":"IF(HideValues!$B$48,NETWORKDAYS(LH9,LH9,Tools!$B$10:$B$55),1)","v":1},{"$f":"IF(HideValues!$B$48,NETWORKDAYS(LI9,LI9,Tools!$B$10:$B$55),1)","v":1},{"$f":"IF(HideValues!$B$48,NETWORKDAYS(LJ9,LJ9,Tools!$B$10:$B$55),1)","v":1},{"$f":"IF(HideValues!$B$48,NETWORKDAYS(LK9,LK9,Tools!$B$10:$B$55),1)","v":1},{"$f":"IF(HideValues!$B$48,NETWORKDAYS(LL9,LL9,Tools!$B$10:$B$55),1)","v":0},{"$f":"IF(HideValues!$B$48,NETWORKDAYS(LM9,LM9,Tools!$B$10:$B$55),1)","v":0},{"$f":"IF(HideValues!$B$48,NETWORKDAYS(LN9,LN9,Tools!$B$10:$B$55),1)","v":1},{"$f":"IF(HideValues!$B$48,NETWORKDAYS(LO9,LO9,Tools!$B$10:$B$55),1)","v":1},{"$f":"IF(HideValues!$B$48,NETWORKDAYS(LP9,LP9,Tools!$B$10:$B$55),1)","v":1},{"$f":"IF(HideValues!$B$48,NETWORKDAYS(LQ9,LQ9,Tools!$B$10:$B$55),1)","v":1},{"$f":"IF(HideValues!$B$48,NETWORKDAYS(LR9,LR9,Tools!$B$10:$B$55),1)","v":1},{"$f":"IF(HideValues!$B$48,NETWORKDAYS(LS9,LS9,Tools!$B$10:$B$55),1)","v":0},{"$f":"IF(HideValues!$B$48,NETWORKDAYS(LT9,LT9,Tools!$B$10:$B$55),1)","v":0},{"$f":"IF(HideValues!$B$48,NETWORKDAYS(LU9,LU9,Tools!$B$10:$B$55),1)","v":1},{"$f":"IF(HideValues!$B$48,NETWORKDAYS(LV9,LV9,Tools!$B$10:$B$55),1)","v":1},{"$f":"IF(HideValues!$B$48,NETWORKDAYS(LW9,LW9,Tools!$B$10:$B$55),1)","v":1},{"$f":"IF(HideValues!$B$48,NETWORKDAYS(LX9,LX9,Tools!$B$10:$B$55),1)","v":1},{"$f":"IF(HideValues!$B$48,NETWORKDAYS(LY9,LY9,Tools!$B$10:$B$55),1)","v":1},{"$f":"IF(HideValues!$B$48,NETWORKDAYS(LZ9,LZ9,Tools!$B$10:$B$55),1)","v":0},{"$f":"IF(HideValues!$B$48,NETWORKDAYS(MA9,MA9,Tools!$B$10:$B$55),1)","v":0},{"$f":"IF(HideValues!$B$48,NETWORKDAYS(MB9,MB9,Tools!$B$10:$B$55),1)","v":1},{"$f":"IF(HideValues!$B$48,NETWORKDAYS(MC9,MC9,Tools!$B$10:$B$55),1)","v":1},{"$f":"IF(HideValues!$B$48,NETWORKDAYS(MD9,MD9,Tools!$B$10:$B$55),1)","v":1},{"$f":"IF(HideValues!$B$48,NETWORKDAYS(ME9,ME9,Tools!$B$10:$B$55),1)","v":1},{"$f":"IF(HideValues!$B$48,NETWORKDAYS(MF9,MF9,Tools!$B$10:$B$55),1)","v":1},{"$f":"IF(HideValues!$B$48,NETWORKDAYS(MG9,MG9,Tools!$B$10:$B$55),1)","v":0},{"$f":"IF(HideValues!$B$48,NETWORKDAYS(MH9,MH9,Tools!$B$10:$B$55),1)","v":0},{"$f":"IF(HideValues!$B$48,NETWORKDAYS(MI9,MI9,Tools!$B$10:$B$55),1)","v":1},{"$f":"IF(HideValues!$B$48,NETWORKDAYS(MJ9,MJ9,Tools!$B$10:$B$55),1)","v":1},{"$f":"IF(HideValues!$B$48,NETWORKDAYS(MK9,MK9,Tools!$B$10:$B$55),1)","v":1},{"$f":"IF(HideValues!$B$48,NETWORKDAYS(ML9,ML9,Tools!$B$10:$B$55),1)","v":1},{"$f":"IF(HideValues!$B$48,NETWORKDAYS(MM9,MM9,Tools!$B$10:$B$55),1)","v":1},{"$f":"IF(HideValues!$B$48,NETWORKDAYS(MN9,MN9,Tools!$B$10:$B$55),1)","v":0},{"$f":"IF(HideValues!$B$48,NETWORKDAYS(MO9,MO9,Tools!$B$10:$B$55),1)","v":0},{"$f":"IF(HideValues!$B$48,NETWORKDAYS(MP9,MP9,Tools!$B$10:$B$55),1)","v":1},{"$f":"IF(HideValues!$B$48,NETWORKDAYS(MQ9,MQ9,Tools!$B$10:$B$55),1)","v":1},{"$f":"IF(HideValues!$B$48,NETWORKDAYS(MR9,MR9,Tools!$B$10:$B$55),1)","v":1},{"$f":"IF(HideValues!$B$48,NETWORKDAYS(MS9,MS9,Tools!$B$10:$B$55),1)","v":1},{"$f":"IF(HideValues!$B$48,NETWORKDAYS(MT9,MT9,Tools!$B$10:$B$55),1)","v":1},{"$f":"IF(HideValues!$B$48,NETWORKDAYS(MU9,MU9,Tools!$B$10:$B$55),1)","v":0},{"$f":"IF(HideValues!$B$48,NETWORKDAYS(MV9,MV9,Tools!$B$10:$B$55),1)","v":0},{"$f":"IF(HideValues!$B$48,NETWORKDAYS(MW9,MW9,Tools!$B$10:$B$55),1)","v":1},{"$f":"IF(HideValues!$B$48,NETWORKDAYS(MX9,MX9,Tools!$B$10:$B$55),1)","v":1},{"$f":"IF(HideValues!$B$48,NETWORKDAYS(MY9,MY9,Tools!$B$10:$B$55),1)","v":1},{"$f":"IF(HideValues!$B$48,NETWORKDAYS(MZ9,MZ9,Tools!$B$10:$B$55),1)","v":1},{"$f":"IF(HideValues!$B$48,NETWORKDAYS(NA9,NA9,Tools!$B$10:$B$55),1)","v":1},{"$f":"IF(HideValues!$B$48,NETWORKDAYS(NB9,NB9,Tools!$B$10:$B$55),1)","v":0},{"$f":"IF(HideValues!$B$48,NETWORKDAYS(NC9,NC9,Tools!$B$10:$B$55),1)","v":0},{"$f":"IF(HideValues!$B$48,NETWORKDAYS(ND9,ND9,Tools!$B$10:$B$55),1)","v":1},{"$f":"IF(HideValues!$B$48,NETWORKDAYS(NE9,NE9,Tools!$B$10:$B$55),1)","v":1},{"$f":"IF(HideValues!$B$48,NETWORKDAYS(NF9,NF9,Tools!$B$10:$B$55),1)","v":1},{"$f":"IF(HideValues!$B$48,NETWORKDAYS(NG9,NG9,Tools!$B$10:$B$55),1)","v":1},{"$f":"IF(HideValues!$B$48,NETWORKDAYS(NH9,NH9,Tools!$B$10:$B$55),1)","v":1},{"$f":"IF(HideValues!$B$48,NETWORKDAYS(NI9,NI9,Tools!$B$10:$B$55),1)","v":0},{"$f":"IF(HideValues!$B$48,NETWORKDAYS(NJ9,NJ9,Tools!$B$10:$B$55),1)","v":0},{"$f":"IF(HideValues!$B$48,NETWORKDAYS(NK9,NK9,Tools!$B$10:$B$55),1)","v":1},{"$f":"IF(HideValues!$B$48,NETWORKDAYS(NL9,NL9,Tools!$B$10:$B$55),1)","v":1},{"$f":"IF(HideValues!$B$48,NETWORKDAYS(NM9,NM9,Tools!$B$10:$B$55),1)","v":1},{"$f":"IF(HideValues!$B$48,NETWORKDAYS(NN9,NN9,Tools!$B$10:$B$55),1)","v":1},{"$f":"IF(HideValues!$B$48,NETWORKDAYS(NO9,NO9,Tools!$B$10:$B$55),1)","v":1},{"$f":"IF(HideValues!$B$48,NETWORKDAYS(NP9,NP9,Tools!$B$10:$B$55),1)","v":0},{"$f":"IF(HideValues!$B$48,NETWORKDAYS(NQ9,NQ9,Tools!$B$10:$B$55),1)","v":0},{"$f":"IF(HideValues!$B$48,NETWORKDAYS(NR9,NR9,Tools!$B$10:$B$55),1)","v":1},{"$f":"IF(HideValues!$B$48,NETWORKDAYS(NS9,NS9,Tools!$B$10:$B$55),1)","v":1},{"$f":"IF(HideValues!$B$48,NETWORKDAYS(NT9,NT9,Tools!$B$10:$B$55),1)","v":1},{"$f":"IF(HideValues!$B$48,NETWORKDAYS(NU9,NU9,Tools!$B$10:$B$55),1)","v":1},{"$f":"IF(HideValues!$B$48,NETWORKDAYS(NV9,NV9,Tools!$B$10:$B$55),1)","v":1},{"$f":"IF(HideValues!$B$48,NETWORKDAYS(NW9,NW9,Tools!$B$10:$B$55),1)","v":0},{"$f":"IF(HideValues!$B$48,NETWORKDAYS(NX9,NX9,Tools!$B$10:$B$55),1)","v":0},{"$f":"IF(HideValues!$B$48,NETWORKDAYS(NY9,NY9,Tools!$B$10:$B$55),1)","v":1},{"$f":"IF(HideValues!$B$48,NETWORKDAYS(NZ9,NZ9,Tools!$B$10:$B$55),1)","v":1},{"$f":"IF(HideValues!$B$48,NETWORKDAYS(OA9,OA9,Tools!$B$10:$B$55),1)","v":1},{"$f":"IF(HideValues!$B$48,NETWORKDAYS(OB9,OB9,Tools!$B$10:$B$55),1)","v":1},{"$f":"IF(HideValues!$B$48,NETWORKDAYS(OC9,OC9,Tools!$B$10:$B$55),1)","v":1},{"$f":"IF(HideValues!$B$48,NETWORKDAYS(OD9,OD9,Tools!$B$10:$B$55),1)","v":0},{"$f":"IF(HideValues!$B$48,NETWORKDAYS(OE9,OE9,Tools!$B$10:$B$55),1)","v":0},{"$f":"IF(HideValues!$B$48,NETWORKDAYS(OF9,OF9,Tools!$B$10:$B$55),1)","v":1},{"$f":"IF(HideValues!$B$48,NETWORKDAYS(OG9,OG9,Tools!$B$10:$B$55),1)","v":1},{"$f":"IF(HideValues!$B$48,NETWORKDAYS(OH9,OH9,Tools!$B$10:$B$55),1)","v":1},{"$f":"IF(HideValues!$B$48,NETWORKDAYS(OI9,OI9,Tools!$B$10:$B$55),1)","v":1},{"$f":"IF(HideValues!$B$48,NETWORKDAYS(OJ9,OJ9,Tools!$B$10:$B$55),1)","v":1},{"$f":"IF(HideValues!$B$48,NETWORKDAYS(OK9,OK9,Tools!$B$10:$B$55),1)","v":0},{"$f":"IF(HideValues!$B$48,NETWORKDAYS(OL9,OL9,Tools!$B$10:$B$55),1)","v":0},{"$f":"IF(HideValues!$B$48,NETWORKDAYS(OM9,OM9,Tools!$B$10:$B$55),1)","v":1},{"$f":"IF(HideValues!$B$48,NETWORKDAYS(ON9,ON9,Tools!$B$10:$B$55),1)","v":1},{"$f":"IF(HideValues!$B$48,NETWORKDAYS(OO9,OO9,Tools!$B$10:$B$55),1)","v":1},{"$f":"IF(HideValues!$B$48,NETWORKDAYS(OP9,OP9,Tools!$B$10:$B$55),1)","v":1},{"$f":"IF(HideValues!$B$48,NETWORKDAYS(OQ9,OQ9,Tools!$B$10:$B$55),1)","v":1},{"$f":"IF(HideValues!$B$48,NETWORKDAYS(OR9,OR9,Tools!$B$10:$B$55),1)","v":0},{"$f":"IF(HideValues!$B$48,NETWORKDAYS(OS9,OS9,Tools!$B$10:$B$55),1)","v":0},{"$f":"IF(HideValues!$B$48,NETWORKDAYS(OT9,OT9,Tools!$B$10:$B$55),1)","v":1},{"$f":"IF(HideValues!$B$48,NETWORKDAYS(OU9,OU9,Tools!$B$10:$B$55),1)","v":1},{"$f":"IF(HideValues!$B$48,NETWORKDAYS(OV9,OV9,Tools!$B$10:$B$55),1)","v":1},{"$f":"IF(HideValues!$B$48,NETWORKDAYS(OW9,OW9,Tools!$B$10:$B$55),1)","v":1},{"$f":"IF(HideValues!$B$48,NETWORKDAYS(OX9,OX9,Tools!$B$10:$B$55),1)","v":1},{"$f":"IF(HideValues!$B$48,NETWORKDAYS(OY9,OY9,Tools!$B$10:$B$55),1)","v":0},{"$f":"IF(HideValues!$B$48,NETWORKDAYS(OZ9,OZ9,Tools!$B$10:$B$55),1)","v":0},{"$f":"IF(HideValues!$B$48,NETWORKDAYS(PA9,PA9,Tools!$B$10:$B$55),1)","v":1},{"$f":"IF(HideValues!$B$48,NETWORKDAYS(PB9,PB9,Tools!$B$10:$B$55),1)","v":1},{"$f":"IF(HideValues!$B$48,NETWORKDAYS(PC9,PC9,Tools!$B$10:$B$55),1)","v":1},{"$f":"IF(HideValues!$B$48,NETWORKDAYS(PD9,PD9,Tools!$B$10:$B$55),1)","v":1},{"$f":"IF(HideValues!$B$48,NETWORKDAYS(PE9,PE9,Tools!$B$10:$B$55),1)","v":1},{"$f":"IF(HideValues!$B$48,NETWORKDAYS(PF9,PF9,Tools!$B$10:$B$55),1)","v":0},{"$f":"IF(HideValues!$B$48,NETWORKDAYS(PG9,PG9,Tools!$B$10:$B$55),1)","v":0},{"$f":"IF(HideValues!$B$48,NETWORKDAYS(PH9,PH9,Tools!$B$10:$B$55),1)","v":1},{"$f":"IF(HideValues!$B$48,NETWORKDAYS(PI9,PI9,Tools!$B$10:$B$55),1)","v":1},{"$f":"IF(HideValues!$B$48,NETWORKDAYS(PJ9,PJ9,Tools!$B$10:$B$55),1)","v":1},{"$f":"IF(HideValues!$B$48,NETWORKDAYS(PK9,PK9,Tools!$B$10:$B$55),1)","v":1},{"$f":"IF(HideValues!$B$48,NETWORKDAYS(PL9,PL9,Tools!$B$10:$B$55),1)","v":1},{"$f":"IF(HideValues!$B$48,NETWORKDAYS(PM9,PM9,Tools!$B$10:$B$55),1)","v":0},{"$f":"IF(HideValues!$B$48,NETWORKDAYS(PN9,PN9,Tools!$B$10:$B$55),1)","v":0},{"$f":"IF(HideValues!$B$48,NETWORKDAYS(PO9,PO9,Tools!$B$10:$B$55),1)","v":1},{"$f":"IF(HideValues!$B$48,NETWORKDAYS(PP9,PP9,Tools!$B$10:$B$55),1)","v":1},{"$f":"IF(HideValues!$B$48,NETWORKDAYS(PQ9,PQ9,Tools!$B$10:$B$55),1)","v":1},{"$f":"IF(HideValues!$B$48,NETWORKDAYS(PR9,PR9,Tools!$B$10:$B$55),1)","v":1},{"$f":"IF(HideValues!$B$48,NETWORKDAYS(PS9,PS9,Tools!$B$10:$B$55),1)","v":1},{"$f":"IF(HideValues!$B$48,NETWORKDAYS(PT9,PT9,Tools!$B$10:$B$55),1)","v":0},{"$f":"IF(HideValues!$B$48,NETWORKDAYS(PU9,PU9,Tools!$B$10:$B$55),1)","v":0},{"$f":"IF(HideValues!$B$48,NETWORKDAYS(PV9,PV9,Tools!$B$10:$B$55),1)","v":1},{"$f":"IF(HideValues!$B$48,NETWORKDAYS(PW9,PW9,Tools!$B$10:$B$55),1)","v":1},{"$f":"IF(HideValues!$B$48,NETWORKDAYS(PX9,PX9,Tools!$B$10:$B$55),1)","v":1},{"$f":"IF(HideValues!$B$48,NETWORKDAYS(PY9,PY9,Tools!$B$10:$B$55),1)","v":1},{"$f":"IF(HideValues!$B$48,NETWORKDAYS(PZ9,PZ9,Tools!$B$10:$B$55),1)","v":1},{"$f":"IF(HideValues!$B$48,NETWORKDAYS(QA9,QA9,Tools!$B$10:$B$55),1)","v":0},{"$f":"IF(HideValues!$B$48,NETWORKDAYS(QB9,QB9,Tools!$B$10:$B$55),1)","v":0},{"$f":"IF(HideValues!$B$48,NETWORKDAYS(QC9,QC9,Tools!$B$10:$B$55),1)","v":1},{"$f":"IF(HideValues!$B$48,NETWORKDAYS(QD9,QD9,Tools!$B$10:$B$55),1)","v":1},{"$f":"IF(HideValues!$B$48,NETWORKDAYS(QE9,QE9,Tools!$B$10:$B$55),1)","v":1},{"$f":"IF(HideValues!$B$48,NETWORKDAYS(QF9,QF9,Tools!$B$10:$B$55),1)","v":1},{"$f":"IF(HideValues!$B$48,NETWORKDAYS(QG9,QG9,Tools!$B$10:$B$55),1)","v":1},{"$f":"IF(HideValues!$B$48,NETWORKDAYS(QH9,QH9,Tools!$B$10:$B$55),1)","v":0},{"$f":"IF(HideValues!$B$48,NETWORKDAYS(QI9,QI9,Tools!$B$10:$B$55),1)","v":0},{"$f":"IF(HideValues!$B$48,NETWORKDAYS(QJ9,QJ9,Tools!$B$10:$B$55),1)","v":1},{"$f":"IF(HideValues!$B$48,NETWORKDAYS(QK9,QK9,Tools!$B$10:$B$55),1)","v":1},{"$f":"IF(HideValues!$B$48,NETWORKDAYS(QL9,QL9,Tools!$B$10:$B$55),1)","v":1},{"$f":"IF(HideValues!$B$48,NETWORKDAYS(QM9,QM9,Tools!$B$10:$B$55),1)","v":1},{"$f":"IF(HideValues!$B$48,NETWORKDAYS(QN9,QN9,Tools!$B$10:$B$55),1)","v":1},{"$f":"IF(HideValues!$B$48,NETWORKDAYS(QO9,QO9,Tools!$B$10:$B$55),1)","v":0},{"$f":"IF(HideValues!$B$48,NETWORKDAYS(QP9,QP9,Tools!$B$10:$B$55),1)","v":0},{"$f":"IF(HideValues!$B$48,NETWORKDAYS(QQ9,QQ9,Tools!$B$10:$B$55),1)","v":1},{"$f":"IF(HideValues!$B$48,NETWORKDAYS(QR9,QR9,Tools!$B$10:$B$55),1)","v":1},{"$f":"IF(HideValues!$B$48,NETWORKDAYS(QS9,QS9,Tools!$B$10:$B$55),1)","v":1},{"$f":"IF(HideValues!$B$48,NETWORKDAYS(QT9,QT9,Tools!$B$10:$B$55),1)","v":1},{"$f":"IF(HideValues!$B$48,NETWORKDAYS(QU9,QU9,Tools!$B$10:$B$55),1)","v":1},{"$f":"IF(HideValues!$B$48,NETWORKDAYS(QV9,QV9,Tools!$B$10:$B$55),1)","v":0},{"$f":"IF(HideValues!$B$48,NETWORKDAYS(QW9,QW9,Tools!$B$10:$B$55),1)","v":0},{"$f":"IF(HideValues!$B$48,NETWORKDAYS(QX9,QX9,Tools!$B$10:$B$55),1)","v":1},{"$f":"IF(HideValues!$B$48,NETWORKDAYS(QY9,QY9,Tools!$B$10:$B$55),1)","v":1},{"$f":"IF(HideValues!$B$48,NETWORKDAYS(QZ9,QZ9,Tools!$B$10:$B$55),1)","v":1},{"$f":"IF(HideValues!$B$48,NETWORKDAYS(RA9,RA9,Tools!$B$10:$B$55),1)","v":1},{"$f":"IF(HideValues!$B$48,NETWORKDAYS(RB9,RB9,Tools!$B$10:$B$55),1)","v":1},{"$f":"IF(HideValues!$B$48,NETWORKDAYS(RC9,RC9,Tools!$B$10:$B$55),1)","v":0},{"$f":"IF(HideValues!$B$48,NETWORKDAYS(RD9,RD9,Tools!$B$10:$B$55),1)","v":0},{"$f":"IF(HideValues!$B$48,NETWORKDAYS(RE9,RE9,Tools!$B$10:$B$55),1)","v":1},{"$f":"IF(HideValues!$B$48,NETWORKDAYS(RF9,RF9,Tools!$B$10:$B$55),1)","v":1},{"$f":"IF(HideValues!$B$48,NETWORKDAYS(RG9,RG9,Tools!$B$10:$B$55),1)","v":1},{"$f":"IF(HideValues!$B$48,NETWORKDAYS(RH9,RH9,Tools!$B$10:$B$55),1)","v":1},{"$f":"IF(HideValues!$B$48,NETWORKDAYS(RI9,RI9,Tools!$B$10:$B$55),1)","v":1},{"$f":"IF(HideValues!$B$48,NETWORKDAYS(RJ9,RJ9,Tools!$B$10:$B$55),1)","v":0},{"$f":"IF(HideValues!$B$48,NETWORKDAYS(RK9,RK9,Tools!$B$10:$B$55),1)","v":0},{"$f":"IF(HideValues!$B$48,NETWORKDAYS(RL9,RL9,Tools!$B$10:$B$55),1)","v":1},{"$f":"IF(HideValues!$B$48,NETWORKDAYS(RM9,RM9,Tools!$B$10:$B$55),1)","v":1},{"$f":"IF(HideValues!$B$48,NETWORKDAYS(RN9,RN9,Tools!$B$10:$B$55),1)","v":1},{"$f":"IF(HideValues!$B$48,NETWORKDAYS(RO9,RO9,Tools!$B$10:$B$55),1)","v":1},{"$f":"IF(HideValues!$B$48,NETWORKDAYS(RP9,RP9,Tools!$B$10:$B$55),1)","v":1},{"$f":"IF(HideValues!$B$48,NETWORKDAYS(RQ9,RQ9,Tools!$B$10:$B$55),1)","v":0},{"$f":"IF(HideValues!$B$48,NETWORKDAYS(RR9,RR9,Tools!$B$10:$B$55),1)","v":0},{"$f":"IF(HideValues!$B$48,NETWORKDAYS(RS9,RS9,Tools!$B$10:$B$55),1)","v":1},{"$f":"IF(HideValues!$B$48,NETWORKDAYS(RT9,RT9,Tools!$B$10:$B$55),1)","v":1},{"$f":"IF(HideValues!$B$48,NETWORKDAYS(RU9,RU9,Tools!$B$10:$B$55),1)","v":1},{"$f":"IF(HideValues!$B$48,NETWORKDAYS(RV9,RV9,Tools!$B$10:$B$55),1)","v":1},{"$f":"IF(HideValues!$B$48,NETWORKDAYS(RW9,RW9,Tools!$B$10:$B$55),1)","v":1},{"$f":"IF(HideValues!$B$48,NETWORKDAYS(RX9,RX9,Tools!$B$10:$B$55),1)","v":0},{"$f":"IF(HideValues!$B$48,NETWORKDAYS(RY9,RY9,Tools!$B$10:$B$55),1)","v":0},{"$f":"IF(HideValues!$B$48,NETWORKDAYS(RZ9,RZ9,Tools!$B$10:$B$55),1)","v":1},{"$f":"IF(HideValues!$B$48,NETWORKDAYS(SA9,SA9,Tools!$B$10:$B$55),1)","v":1},{"$f":"IF(HideValues!$B$48,NETWORKDAYS(SB9,SB9,Tools!$B$10:$B$55),1)","v":1},{"$f":"IF(HideValues!$B$48,NETWORKDAYS(SC9,SC9,Tools!$B$10:$B$55),1)","v":1},{"$f":"IF(HideValues!$B$48,NETWORKDAYS(SD9,SD9,Tools!$B$10:$B$55),1)","v":1},{"$f":"IF(HideValues!$B$48,NETWORKDAYS(SE9,SE9,Tools!$B$10:$B$55),1)","v":0},{"$f":"IF(HideValues!$B$48,NETWORKDAYS(SF9,SF9,Tools!$B$10:$B$55),1)","v":0},{"$f":"IF(HideValues!$B$48,NETWORKDAYS(SG9,SG9,Tools!$B$10:$B$55),1)","v":1},{"$f":"IF(HideValues!$B$48,NETWORKDAYS(SH9,SH9,Tools!$B$10:$B$55),1)","v":1},{"$f":"IF(HideValues!$B$48,NETWORKDAYS(SI9,SI9,Tools!$B$10:$B$55),1)","v":1},{"$f":"IF(HideValues!$B$48,NETWORKDAYS(SJ9,SJ9,Tools!$B$10:$B$55),1)","v":1},{"$f":"IF(HideValues!$B$48,NETWORKDAYS(SK9,SK9,Tools!$B$10:$B$55),1)","v":1},{"$f":"IF(HideValues!$B$48,NETWORKDAYS(SL9,SL9,Tools!$B$10:$B$55),1)","v":0},{"$f":"IF(HideValues!$B$48,NETWORKDAYS(SM9,SM9,Tools!$B$10:$B$55),1)","v":0},{"$f":"IF(HideValues!$B$48,NETWORKDAYS(SN9,SN9,Tools!$B$10:$B$55),1)","v":1},{"$f":"IF(HideValues!$B$48,NETWORKDAYS(SO9,SO9,Tools!$B$10:$B$55),1)","v":1},{"$f":"IF(HideValues!$B$48,NETWORKDAYS(SP9,SP9,Tools!$B$10:$B$55),1)","v":1},{"$f":"IF(HideValues!$B$48,NETWORKDAYS(SQ9,SQ9,Tools!$B$10:$B$55),1)","v":1},{"$f":"IF(HideValues!$B$48,NETWORKDAYS(SR9,SR9,Tools!$B$10:$B$55),1)","v":1},{"$f":"IF(HideValues!$B$48,NETWORKDAYS(SS9,SS9,Tools!$B$10:$B$55),1)","v":0},{"$f":"IF(HideValues!$B$48,NETWORKDAYS(ST9,ST9,Tools!$B$10:$B$55),1)","v":0},{"$f":"IF(HideValues!$B$48,NETWORKDAYS(SU9,SU9,Tools!$B$10:$B$55),1)","v":1},{"$f":"IF(HideValues!$B$48,NETWORKDAYS(SV9,SV9,Tools!$B$10:$B$55),1)","v":1},{"$f":"IF(HideValues!$B$48,NETWORKDAYS(SW9,SW9,Tools!$B$10:$B$55),1)","v":1},{"$f":"IF(HideValues!$B$48,NETWORKDAYS(SX9,SX9,Tools!$B$10:$B$55),1)","v":1},{"$f":"IF(HideValues!$B$48,NETWORKDAYS(SY9,SY9,Tools!$B$10:$B$55),1)","v":1},{"$f":"IF(HideValues!$B$48,NETWORKDAYS(SZ9,SZ9,Tools!$B$10:$B$55),1)","v":0},{"$f":"IF(HideValues!$B$48,NETWORKDAYS(TA9,TA9,Tools!$B$10:$B$55),1)","v":0},{"$f":"IF(HideValues!$B$48,NETWORKDAYS(TB9,TB9,Tools!$B$10:$B$55),1)","v":1},{"$f":"IF(HideValues!$B$48,NETWORKDAYS(TC9,TC9,Tools!$B$10:$B$55),1)","v":1},{"$f":"IF(HideValues!$B$48,NETWORKDAYS(TD9,TD9,Tools!$B$10:$B$55),1)","v":1},{"$f":"IF(HideValues!$B$48,NETWORKDAYS(TE9,TE9,Tools!$B$10:$B$55),1)","v":1},{"$f":"IF(HideValues!$B$48,NETWORKDAYS(TF9,TF9,Tools!$B$10:$B$55),1)","v":1},{"$f":"IF(HideValues!$B$48,NETWORKDAYS(TG9,TG9,Tools!$B$10:$B$55),1)","v":0},{"$f":"IF(HideValues!$B$48,NETWORKDAYS(TH9,TH9,Tools!$B$10:$B$55),1)","v":0},{"$f":"IF(HideValues!$B$48,NETWORKDAYS(TI9,TI9,Tools!$B$10:$B$55),1)","v":1},{"$f":"IF(HideValues!$B$48,NETWORKDAYS(TJ9,TJ9,Tools!$B$10:$B$55),1)","v":1},{"$f":"IF(HideValues!$B$48,NETWORKDAYS(TK9,TK9,Tools!$B$10:$B$55),1)","v":1},{"$f":"IF(HideValues!$B$48,NETWORKDAYS(TL9,TL9,Tools!$B$10:$B$55),1)","v":1},{"$f":"IF(HideValues!$B$48,NETWORKDAYS(TM9,TM9,Tools!$B$10:$B$55),1)","v":1},{"$f":"IF(HideValues!$B$48,NETWORKDAYS(TN9,TN9,Tools!$B$10:$B$55),1)","v":0},{"$f":"IF(HideValues!$B$48,NETWORKDAYS(TO9,TO9,Tools!$B$10:$B$55),1)","v":0},{"$f":"IF(HideValues!$B$48,NETWORKDAYS(TP9,TP9,Tools!$B$10:$B$55),1)","v":1},{"$f":"IF(HideValues!$B$48,NETWORKDAYS(TQ9,TQ9,Tools!$B$10:$B$55),1)","v":1},{"$f":"IF(HideValues!$B$48,NETWORKDAYS(TR9,TR9,Tools!$B$10:$B$55),1)","v":1},{"$f":"IF(HideValues!$B$48,NETWORKDAYS(TS9,TS9,Tools!$B$10:$B$55),1)","v":1},{"$f":"IF(HideValues!$B$48,NETWORKDAYS(TT9,TT9,Tools!$B$10:$B$55),1)","v":1},{"$f":"IF(HideValues!$B$48,NETWORKDAYS(TU9,TU9,Tools!$B$10:$B$55),1)","v":0},{"$f":"IF(HideValues!$B$48,NETWORKDAYS(TV9,TV9,Tools!$B$10:$B$55),1)","v":0},{"$f":"IF(HideValues!$B$48,NETWORKDAYS(TW9,TW9,Tools!$B$10:$B$55),1)","v":1},{"$f":"IF(HideValues!$B$48,NETWORKDAYS(TX9,TX9,Tools!$B$10:$B$55),1)","v":1},{"$f":"IF(HideValues!$B$48,NETWORKDAYS(TY9,TY9,Tools!$B$10:$B$55),1)","v":1},{"$f":"IF(HideValues!$B$48,NETWORKDAYS(TZ9,TZ9,Tools!$B$10:$B$55),1)","v":1},{"$f":"IF(HideValues!$B$48,NETWORKDAYS(UA9,UA9,Tools!$B$10:$B$55),1)","v":1},{"$f":"IF(HideValues!$B$48,NETWORKDAYS(UB9,UB9,Tools!$B$10:$B$55),1)","v":0},{"$f":"IF(HideValues!$B$48,NETWORKDAYS(UC9,UC9,Tools!$B$10:$B$55),1)","v":0},{"$f":"IF(HideValues!$B$48,NETWORKDAYS(UD9,UD9,Tools!$B$10:$B$55),1)","v":1},{"$f":"IF(HideValues!$B$48,NETWORKDAYS(UE9,UE9,Tools!$B$10:$B$55),1)","v":1},{"$f":"IF(HideValues!$B$48,NETWORKDAYS(UF9,UF9,Tools!$B$10:$B$55),1)","v":1},{"$f":"IF(HideValues!$B$48,NETWORKDAYS(UG9,UG9,Tools!$B$10:$B$55),1)","v":1},{"$f":"IF(HideValues!$B$48,NETWORKDAYS(UH9,UH9,Tools!$B$10:$B$55),1)","v":1},{"$f":"IF(HideValues!$B$48,NETWORKDAYS(UI9,UI9,Tools!$B$10:$B$55),1)","v":0},{"$f":"IF(HideValues!$B$48,NETWORKDAYS(UJ9,UJ9,Tools!$B$10:$B$55),1)","v":0},{"$f":"IF(HideValues!$B$48,NETWORKDAYS(UK9,UK9,Tools!$B$10:$B$55),1)","v":1},{"$f":"IF(HideValues!$B$48,NETWORKDAYS(UL9,UL9,Tools!$B$10:$B$55),1)","v":1},{"$f":"IF(HideValues!$B$48,NETWORKDAYS(UM9,UM9,Tools!$B$10:$B$55),1)","v":1},{"$f":"IF(HideValues!$B$48,NETWORKDAYS(UN9,UN9,Tools!$B$10:$B$55),1)","v":1},{"$f":"IF(HideValues!$B$48,NETWORKDAYS(UO9,UO9,Tools!$B$10:$B$55),1)","v":1},{"$f":"IF(HideValues!$B$48,NETWORKDAYS(UP9,UP9,Tools!$B$10:$B$55),1)","v":0},{"$f":"IF(HideValues!$B$48,NETWORKDAYS(UQ9,UQ9,Tools!$B$10:$B$55),1)","v":0},{"$f":"IF(HideValues!$B$48,NETWORKDAYS(UR9,UR9,Tools!$B$10:$B$55),1)","v":1},{"$f":"IF(HideValues!$B$48,NETWORKDAYS(US9,US9,Tools!$B$10:$B$55),1)","v":1},{"$f":"IF(HideValues!$B$48,NETWORKDAYS(UT9,UT9,Tools!$B$10:$B$55),1)","v":1},{"$f":"IF(HideValues!$B$48,NETWORKDAYS(UU9,UU9,Tools!$B$10:$B$55),1)","v":1},{"$f":"IF(HideValues!$B$48,NETWORKDAYS(UV9,UV9,Tools!$B$10:$B$55),1)","v":1},{"$f":"IF(HideValues!$B$48,NETWORKDAYS(UW9,UW9,Tools!$B$10:$B$55),1)","v":0},{"$f":"IF(HideValues!$B$48,NETWORKDAYS(UX9,UX9,Tools!$B$10:$B$55),1)","v":0},{"$f":"IF(HideValues!$B$48,NETWORKDAYS(UY9,UY9,Tools!$B$10:$B$55),1)","v":1},{"$f":"IF(HideValues!$B$48,NETWORKDAYS(UZ9,UZ9,Tools!$B$10:$B$55),1)","v":1},{"$f":"IF(HideValues!$B$48,NETWORKDAYS(VA9,VA9,Tools!$B$10:$B$55),1)","v":1},{"$f":"IF(HideValues!$B$48,NETWORKDAYS(VB9,VB9,Tools!$B$10:$B$55),1)","v":1},{"$f":"IF(HideValues!$B$48,NETWORKDAYS(VC9,VC9,Tools!$B$10:$B$55),1)","v":1},{"$f":"IF(HideValues!$B$48,NETWORKDAYS(VD9,VD9,Tools!$B$10:$B$55),1)","v":0},{"$f":"IF(HideValues!$B$48,NETWORKDAYS(VE9,VE9,Tools!$B$10:$B$55),1)","v":0},{"$f":"IF(HideValues!$B$48,NETWORKDAYS(VF9,VF9,Tools!$B$10:$B$55),1)","v":1}]
[null,null,null,null,null,null,null,null,null,null,null,null,null,null,null,null,null,null,null,null,null,null,null,null,null,null,null,null,null,null,null,null,{"$f":"HideValues!D4","v":"2016-11-08"},{"$f":"AG9+1","v":"2016-11-09"},"2016-11-10","2016-11-11","2016-11-12","2016-11-13","2016-11-14","2016-11-15",{"$f":"AN9+1","v":"2016-11-16"},"2016-11-17",{"$f":"AP9+1","v":"2016-11-18"},"2016-11-19","2016-11-20","2016-11-21","2016-11-22","2016-11-23","2016-11-24","2016-11-25","2016-11-26","2016-11-27","2016-11-28",{"$f":"BA9+1","v":"2016-11-29"},{"$f":"BB9+1","v":"2016-11-30"},"2016-12-01","2016-12-02","2016-12-03","2016-12-04","2016-12-05","2016-12-06","2016-12-07","2016-12-08","2016-12-09","2016-12-10","2016-12-11","2016-12-12","2016-12-13","2016-12-14","2016-12-15","2016-12-16","2016-12-17","2016-12-18","2016-12-19","2016-12-20","2016-12-21","2016-12-22","2016-12-23","2016-12-24","2016-12-25","2016-12-26","2016-12-27","2016-12-28","2016-12-29","2016-12-30","2016-12-31","2017-01-01","2017-01-02","2017-01-03","2017-01-04","2017-01-05","2017-01-06","2017-01-07","2017-01-08","2017-01-09","2017-01-10","2017-01-11","2017-01-12",{"$f":"CT9+1","v":"2017-01-13"},"2017-01-14","2017-01-15","2017-01-16","2017-01-17","2017-01-18","2017-01-19","2017-01-20","2017-01-21","2017-01-22","2017-01-23","2017-01-24","2017-01-25","2017-01-26","2017-01-27","2017-01-28","2017-01-29","2017-01-30","2017-01-31","2017-02-01","2017-02-02","2017-02-03","2017-02-04","2017-02-05","2017-02-06","2017-02-07","2017-02-08","2017-02-09","2017-02-10",{"$f":"DW9+1","v":"2017-02-11"},"2017-02-12","2017-02-13","2017-02-14","2017-02-15","2017-02-16","2017-02-17","2017-02-18","2017-02-19","2017-02-20","2017-02-21","2017-02-22","2017-02-23","2017-02-24","2017-02-25","2017-02-26","2017-02-27","2017-02-28","2017-03-01","2017-03-02","2017-03-03","2017-03-04","2017-03-05","2017-03-06","2017-03-07","2017-03-08","2017-03-09","2017-03-10","2017-03-11","2017-03-12","2017-03-13","2017-03-14","2017-03-15","2017-03-16","2017-03-17","2017-03-18","2017-03-19","2017-03-20","2017-03-21","2017-03-22","2017-03-23","2017-03-24","2017-03-25","2017-03-26","2017-03-27","2017-03-28","2017-03-29","2017-03-30","2017-03-31","2017-04-01","2017-04-02","2017-04-03","2017-04-04","2017-04-05","2017-04-06","2017-04-07","2017-04-08","2017-04-09","2017-04-10","2017-04-11","2017-04-12","2017-04-13","2017-04-14","2017-04-15",{"$f":"GI9+1","v":"2017-04-16"},"2017-04-17","2017-04-18","2017-04-19","2017-04-20","2017-04-21","2017-04-22","2017-04-23","2017-04-24","2017-04-25","2017-04-26","2017-04-27","2017-04-28","2017-04-29","2017-04-30","2017-05-01","2017-05-02","2017-05-03","2017-05-04","2017-05-05","2017-05-06","2017-05-07","2017-05-08","2017-05-09","2017-05-10","2017-05-11","2017-05-12","2017-05-13","2017-05-14","2017-05-15","2017-05-16","2017-05-17","2017-05-18","2017-05-19","2017-05-20","2017-05-21","2017-05-22","2017-05-23","2017-05-24","2017-05-25","2017-05-26","2017-05-27","2017-05-28","2017-05-29","2017-05-30","2017-05-31","2017-06-01","2017-06-02","2017-06-03","2017-06-04","2017-06-05","2017-06-06","2017-06-07","2017-06-08","2017-06-09","2017-06-10","2017-06-11","2017-06-12","2017-06-13","2017-06-14","2017-06-15","2017-06-16","2017-06-17","2017-06-18",{"$f":"IU9+1","v":"2017-06-19"},"2017-06-20","2017-06-21","2017-06-22","2017-06-23","2017-06-24","2017-06-25","2017-06-26","2017-06-27","2017-06-28","2017-06-29","2017-06-30","2017-07-01","2017-07-02","2017-07-03","2017-07-04","2017-07-05","2017-07-06","2017-07-07","2017-07-08","2017-07-09","2017-07-10","2017-07-11","2017-07-12","2017-07-13","2017-07-14","2017-07-15","2017-07-16","2017-07-17","2017-07-18","2017-07-19","2017-07-20","2017-07-21","2017-07-22","2017-07-23","2017-07-24","2017-07-25","2017-07-26","2017-07-27","2017-07-28","2017-07-29","2017-07-30","2017-07-31","2017-08-01","2017-08-02","2017-08-03","2017-08-04","2017-08-05","2017-08-06","2017-08-07","2017-08-08","2017-08-09","2017-08-10","2017-08-11","2017-08-12","2017-08-13","2017-08-14","2017-08-15","2017-08-16","2017-08-17","2017-08-18","2017-08-19","2017-08-20","2017-08-21",{"$f":"LG9+1","v":"2017-08-22"},"2017-08-23","2017-08-24","2017-08-25","2017-08-26","2017-08-27","2017-08-28","2017-08-29","2017-08-30","2017-08-31","2017-09-01","2017-09-02","2017-09-03","2017-09-04","2017-09-05","2017-09-06","2017-09-07","2017-09-08","2017-09-09","2017-09-10","2017-09-11","2017-09-12","2017-09-13","2017-09-14","2017-09-15","2017-09-16","2017-09-17","2017-09-18","2017-09-19","2017-09-20","2017-09-21","2017-09-22","2017-09-23","2017-09-24","2017-09-25","2017-09-26","2017-09-27","2017-09-28","2017-09-29","2017-09-30","2017-10-01","2017-10-02","2017-10-03","2017-10-04","2017-10-05","2017-10-06","2017-10-07","2017-10-08","2017-10-09","2017-10-10","2017-10-11","2017-10-12","2017-10-13","2017-10-14","2017-10-15","2017-10-16","2017-10-17","2017-10-18","2017-10-19","2017-10-20","2017-10-21","2017-10-22","2017-10-23","2017-10-24",{"$f":"NS9+1","v":"2017-10-25"},"2017-10-26","2017-10-27","2017-10-28","2017-10-29","2017-10-30","2017-10-31","2017-11-01","2017-11-02","2017-11-03","2017-11-04","2017-11-05","2017-11-06","2017-11-07","2017-11-08","2017-11-09","2017-11-10","2017-11-11","2017-11-12","2017-11-13","2017-11-14","2017-11-15","2017-11-16","2017-11-17","2017-11-18","2017-11-19","2017-11-20","2017-11-21","2017-11-22","2017-11-23","2017-11-24","2017-11-25","2017-11-26","2017-11-27","2017-11-28","2017-11-29","2017-11-30","2017-12-01","2017-12-02","2017-12-03","2017-12-04","2017-12-05","2017-12-06","2017-12-07","2017-12-08","2017-12-09","2017-12-10","2017-12-11","2017-12-12","2017-12-13","2017-12-14","2017-12-15","2017-12-16","2017-12-17","2017-12-18","2017-12-19","2017-12-20","2017-12-21","2017-12-22","2017-12-23","2017-12-24","2017-12-25","2017-12-26","2017-12-27",{"$f":"QE9+1","v":"2017-12-28"},"2017-12-29","2017-12-30","2017-12-31","2018-01-01","2018-01-02","2018-01-03","2018-01-04","2018-01-05","2018-01-06","2018-01-07","2018-01-08","2018-01-09","2018-01-10","2018-01-11","2018-01-12","2018-01-13","2018-01-14","2018-01-15","2018-01-16","2018-01-17","2018-01-18","2018-01-19","2018-01-20","2018-01-21","2018-01-22","2018-01-23","2018-01-24","2018-01-25","2018-01-26","2018-01-27","2018-01-28","2018-01-29","2018-01-30","2018-01-31","2018-02-01","2018-02-02","2018-02-03","2018-02-04","2018-02-05","2018-02-06","2018-02-07","2018-02-08","2018-02-09","2018-02-10","2018-02-11","2018-02-12","2018-02-13","2018-02-14","2018-02-15","2018-02-16","2018-02-17","2018-02-18","2018-02-19","2018-02-20","2018-02-21","2018-02-22","2018-02-23","2018-02-24","2018-02-25","2018-02-26","2018-02-27","2018-02-28","2018-03-01",{"$f":"SQ9+1","v":"2018-03-02"},"2018-03-03","2018-03-04","2018-03-05","2018-03-06","2018-03-07","2018-03-08","2018-03-09","2018-03-10","2018-03-11","2018-03-12","2018-03-13","2018-03-14","2018-03-15","2018-03-16","2018-03-17","2018-03-18","2018-03-19","2018-03-20","2018-03-21","2018-03-22","2018-03-23","2018-03-24","2018-03-25","2018-03-26","2018-03-27","2018-03-28","2018-03-29","2018-03-30","2018-03-31","2018-04-01","2018-04-02","2018-04-03","2018-04-04","2018-04-05","2018-04-06","2018-04-07","2018-04-08","2018-04-09","2018-04-10","2018-04-11","2018-04-12","2018-04-13","2018-04-14","2018-04-15","2018-04-16","2018-04-17","2018-04-18","2018-04-19","2018-04-20","2018-04-21","2018-04-22","2018-04-23","2018-04-24","2018-04-25","2018-04-26","2018-04-27","2018-04-28","2018-04-29","2018-04-30","2018-05-01","2018-05-02","2018-05-03","2018-05-04","2018-05-05","2018-05-06","2018-05-07"]
[null,null,null,null,null,null,null,null,null,null,null,null,null,null,null,null,null,null,null,null,null,null,null,null,null,null,null,null,null,null,null,null,{"$f":"IF(DAY(AG18)=1,AG18,IF(AG9=HideValues!$D$3,\"TODAY\",\"\"))","v":""},{"$f":"IF(DAY(AH18)=1,AH18,IF(AH9=HideValues!$D$3,\"TODAY\",\"\"))","v":""},{"$f":"IF(DAY(AI18)=1,AI18,IF(AI9=HideValues!$D$3,\"TODAY\",\"\"))","v":""},{"$f":"IF(DAY(AJ18)=1,AJ18,IF(AJ9=HideValues!$D$3,\"TODAY\",\"\"))","v":""},{"$f":"IF(DAY(AK18)=1,AK18,IF(AK9=HideValues!$D$3,\"TODAY\",\"\"))","v":""},{"$f":"IF(DAY(AL18)=1,AL18,IF(AL9=HideValues!$D$3,\"TODAY\",\"\"))","v":""},{"$f":"IF(DAY(AM18)=1,AM18,IF(AM9=HideValues!$D$3,\"TODAY\",\"\"))","v":""},{"$f":"IF(DAY(AN18)=1,AN18,IF(AN9=HideValues!$D$3,\"TODAY\",\"\"))","v":"TODAY"},{"$f":"IF(DAY(AO18)=1,AO18,IF(AO9=HideValues!$D$3,\"TODAY\",\"\"))","v":""},{"$f":"IF(DAY(AP18)=1,AP18,IF(AP9=HideValues!$D$3,\"TODAY\",\"\"))","v":""},{"$f":"IF(DAY(AQ18)=1,AQ18,IF(AQ9=HideValues!$D$3,\"TODAY\",\"\"))","v":""},{"$f":"IF(DAY(AR18)=1,AR18,IF(AR9=HideValues!$D$3,\"TODAY\",\"\"))","v":""},{"$f":"IF(DAY(AS18)=1,AS18,IF(AS9=HideValues!$D$3,\"TODAY\",\"\"))","v":""},{"$f":"IF(DAY(AT18)=1,AT18,IF(AT9=HideValues!$D$3,\"TODAY\",\"\"))","v":""},{"$f":"IF(DAY(AU18)=1,AU18,IF(AU9=HideValues!$D$3,\"TODAY\",\"\"))","v":""},{"$f":"IF(DAY(AV18)=1,AV18,IF(AV9=HideValues!$D$3,\"TODAY\",\"\"))","v":""},{"$f":"IF(DAY(AW18)=1,AW18,IF(AW9=HideValues!$D$3,\"TODAY\",\"\"))","v":""},{"$f":"IF(DAY(AX18)=1,AX18,IF(AX9=HideValues!$D$3,\"TODAY\",\"\"))","v":""},{"$f":"IF(DAY(AY18)=1,AY18,IF(AY9=HideValues!$D$3,\"TODAY\",\"\"))","v":""},{"$f":"IF(DAY(AZ18)=1,AZ18,IF(AZ9=HideValues!$D$3,\"TODAY\",\"\"))","v":""},{"$f":"IF(DAY(BA18)=1,BA18,IF(BA9=HideValues!$D$3,\"TODAY\",\"\"))","v":""},{"$f":"IF(DAY(BB18)=1,BB18,IF(BB9=HideValues!$D$3,\"TODAY\",\"\"))","v":""},{"$f":"IF(DAY(BC18)=1,BC18,IF(BC9=HideValues!$D$3,\"TODAY\",\"\"))","v":""},{"$f":"IF(DAY(BD18)=1,BD18,IF(BD9=HideValues!$D$3,\"TODAY\",\"\"))","v":"2016-12-01"},{"$f":"IF(DAY(BE18)=1,BE18,IF(BE9=HideValues!$D$3,\"TODAY\",\"\"))","v":""},{"$f":"IF(DAY(BF18)=1,BF18,IF(BF9=HideValues!$D$3,\"TODAY\",\"\"))","v":""},{"$f":"IF(DAY(BG18)=1,BG18,IF(BG9=HideValues!$D$3,\"TODAY\",\"\"))","v":""},{"$f":"IF(DAY(BH18)=1,BH18,IF(BH9=HideValues!$D$3,\"TODAY\",\"\"))","v":""},{"$f":"IF(DAY(BI18)=1,BI18,IF(BI9=HideValues!$D$3,\"TODAY\",\"\"))","v":""},{"$f":"IF(DAY(BJ18)=1,BJ18,IF(BJ9=HideValues!$D$3,\"TODAY\",\"\"))","v":""},{"$f":"IF(DAY(BK18)=1,BK18,IF(BK9=HideValues!$D$3,\"TODAY\",\"\"))","v":""},{"$f":"IF(DAY(BL18)=1,BL18,IF(BL9=HideValues!$D$3,\"TODAY\",\"\"))","v":""},{"$f":"IF(DAY(BM18)=1,BM18,IF(BM9=HideValues!$D$3,\"TODAY\",\"\"))","v":""},{"$f":"IF(DAY(BN18)=1,BN18,IF(BN9=HideValues!$D$3,\"TODAY\",\"\"))","v":""},{"$f":"IF(DAY(BO18)=1,BO18,IF(BO9=HideValues!$D$3,\"TODAY\",\"\"))","v":""},{"$f":"IF(DAY(BP18)=1,BP18,IF(BP9=HideValues!$D$3,\"TODAY\",\"\"))","v":""},{"$f":"IF(DAY(BQ18)=1,BQ18,IF(BQ9=HideValues!$D$3,\"TODAY\",\"\"))","v":""},{"$f":"IF(DAY(BR18)=1,BR18,IF(BR9=HideValues!$D$3,\"TODAY\",\"\"))","v":""},{"$f":"IF(DAY(BS18)=1,BS18,IF(BS9=HideValues!$D$3,\"TODAY\",\"\"))","v":""},{"$f":"IF(DAY(BT18)=1,BT18,IF(BT9=HideValues!$D$3,\"TODAY\",\"\"))","v":""},{"$f":"IF(DAY(BU18)=1,BU18,IF(BU9=HideValues!$D$3,\"TODAY\",\"\"))","v":""},{"$f":"IF(DAY(BV18)=1,BV18,IF(BV9=HideValues!$D$3,\"TODAY\",\"\"))","v":""},{"$f":"IF(DAY(BW18)=1,BW18,IF(BW9=HideValues!$D$3,\"TODAY\",\"\"))","v":""},{"$f":"IF(DAY(BX18)=1,BX18,IF(BX9=HideValues!$D$3,\"TODAY\",\"\"))","v":""},{"$f":"IF(DAY(BY18)=1,BY18,IF(BY9=HideValues!$D$3,\"TODAY\",\"\"))","v":""},{"$f":"IF(DAY(BZ18)=1,BZ18,IF(BZ9=HideValues!$D$3,\"TODAY\",\"\"))","v":""},{"$f":"IF(DAY(CA18)=1,CA18,IF(CA9=HideValues!$D$3,\"TODAY\",\"\"))","v":""},{"$f":"IF(DAY(CB18)=1,CB18,IF(CB9=HideValues!$D$3,\"TODAY\",\"\"))","v":""},{"$f":"IF(DAY(CC18)=1,CC18,IF(CC9=HideValues!$D$3,\"TODAY\",\"\"))","v":""},{"$f":"IF(DAY(CD18)=1,CD18,IF(CD9=HideValues!$D$3,\"TODAY\",\"\"))","v":""},{"$f":"IF(DAY(CE18)=1,CE18,IF(CE9=HideValues!$D$3,\"TODAY\",\"\"))","v":""},{"$f":"IF(DAY(CF18)=1,CF18,IF(CF9=HideValues!$D$3,\"TODAY\",\"\"))","v":""},{"$f":"IF(DAY(CG18)=1,CG18,IF(CG9=HideValues!$D$3,\"TODAY\",\"\"))","v":""},{"$f":"IF(DAY(CH18)=1,CH18,IF(CH9=HideValues!$D$3,\"TODAY\",\"\"))","v":""},{"$f":"IF(DAY(CI18)=1,CI18,IF(CI9=HideValues!$D$3,\"TODAY\",\"\"))","v":"2017-01-01"},{"$f":"IF(DAY(CJ18)=1,CJ18,IF(CJ9=HideValues!$D$3,\"TODAY\",\"\"))","v":""},{"$f":"IF(DAY(CK18)=1,CK18,IF(CK9=HideValues!$D$3,\"TODAY\",\"\"))","v":""},{"$f":"IF(DAY(CL18)=1,CL18,IF(CL9=HideValues!$D$3,\"TODAY\",\"\"))","v":""},{"$f":"IF(DAY(CM18)=1,CM18,IF(CM9=HideValues!$D$3,\"TODAY\",\"\"))","v":""},{"$f":"IF(DAY(CN18)=1,CN18,IF(CN9=HideValues!$D$3,\"TODAY\",\"\"))","v":""},{"$f":"IF(DAY(CO18)=1,CO18,IF(CO9=HideValues!$D$3,\"TODAY\",\"\"))","v":""},{"$f":"IF(DAY(CP18)=1,CP18,IF(CP9=HideValues!$D$3,\"TODAY\",\"\"))","v":""},{"$f":"IF(DAY(CQ18)=1,CQ18,IF(CQ9=HideValues!$D$3,\"TODAY\",\"\"))","v":""},{"$f":"IF(DAY(CR18)=1,CR18,IF(CR9=HideValues!$D$3,\"TODAY\",\"\"))","v":""},{"$f":"IF(DAY(CS18)=1,CS18,IF(CS9=HideValues!$D$3,\"TODAY\",\"\"))","v":""},{"$f":"IF(DAY(CT18)=1,CT18,IF(CT9=HideValues!$D$3,\"TODAY\",\"\"))","v":""},{"$f":"IF(DAY(CU18)=1,CU18,IF(CU9=HideValues!$D$3,\"TODAY\",\"\"))","v":""},{"$f":"IF(DAY(CV18)=1,CV18,IF(CV9=HideValues!$D$3,\"TODAY\",\"\"))","v":""},{"$f":"IF(DAY(CW18)=1,CW18,IF(CW9=HideValues!$D$3,\"TODAY\",\"\"))","v":""},{"$f":"IF(DAY(CX18)=1,CX18,IF(CX9=HideValues!$D$3,\"TODAY\",\"\"))","v":""},{"$f":"IF(DAY(CY18)=1,CY18,IF(CY9=HideValues!$D$3,\"TODAY\",\"\"))","v":""},{"$f":"IF(DAY(CZ18)=1,CZ18,IF(CZ9=HideValues!$D$3,\"TODAY\",\"\"))","v":""},{"$f":"IF(DAY(DA18)=1,DA18,IF(DA9=HideValues!$D$3,\"TODAY\",\"\"))","v":""},{"$f":"IF(DAY(DB18)=1,DB18,IF(DB9=HideValues!$D$3,\"TODAY\",\"\"))","v":""},{"$f":"IF(DAY(DC18)=1,DC18,IF(DC9=HideValues!$D$3,\"TODAY\",\"\"))","v":""},{"$f":"IF(DAY(DD18)=1,DD18,IF(DD9=HideValues!$D$3,\"TODAY\",\"\"))","v":""},{"$f":"IF(DAY(DE18)=1,DE18,IF(DE9=HideValues!$D$3,\"TODAY\",\"\"))","v":""},{"$f":"IF(DAY(DF18)=1,DF18,IF(DF9=HideValues!$D$3,\"TODAY\",\"\"))","v":""},{"$f":"IF(DAY(DG18)=1,DG18,IF(DG9=HideValues!$D$3,\"TODAY\",\"\"))","v":""},{"$f":"IF(DAY(DH18)=1,DH18,IF(DH9=HideValues!$D$3,\"TODAY\",\"\"))","v":""},{"$f":"IF(DAY(DI18)=1,DI18,IF(DI9=HideValues!$D$3,\"TODAY\",\"\"))","v":""},{"$f":"IF(DAY(DJ18)=1,DJ18,IF(DJ9=HideValues!$D$3,\"TODAY\",\"\"))","v":""},{"$f":"IF(DAY(DK18)=1,DK18,IF(DK9=HideValues!$D$3,\"TODAY\",\"\"))","v":""},{"$f":"IF(DAY(DL18)=1,DL18,IF(DL9=HideValues!$D$3,\"TODAY\",\"\"))","v":""},{"$f":"IF(DAY(DM18)=1,DM18,IF(DM9=HideValues!$D$3,\"TODAY\",\"\"))","v":""},{"$f":"IF(DAY(DN18)=1,DN18,IF(DN9=HideValues!$D$3,\"TODAY\",\"\"))","v":"2017-02-01"},{"$f":"IF(DAY(DO18)=1,DO18,IF(DO9=HideValues!$D$3,\"TODAY\",\"\"))","v":""},{"$f":"IF(DAY(DP18)=1,DP18,IF(DP9=HideValues!$D$3,\"TODAY\",\"\"))","v":""},{"$f":"IF(DAY(DQ18)=1,DQ18,IF(DQ9=HideValues!$D$3,\"TODAY\",\"\"))","v":""},{"$f":"IF(DAY(DR18)=1,DR18,IF(DR9=HideValues!$D$3,\"TODAY\",\"\"))","v":""},{"$f":"IF(DAY(DS18)=1,DS18,IF(DS9=HideValues!$D$3,\"TODAY\",\"\"))","v":""},{"$f":"IF(DAY(DT18)=1,DT18,IF(DT9=HideValues!$D$3,\"TODAY\",\"\"))","v":""},{"$f":"IF(DAY(DU18)=1,DU18,IF(DU9=HideValues!$D$3,\"TODAY\",\"\"))","v":""},{"$f":"IF(DAY(DV18)=1,DV18,IF(DV9=HideValues!$D$3,\"TODAY\",\"\"))","v":""},{"$f":"IF(DAY(DW18)=1,DW18,IF(DW9=HideValues!$D$3,\"TODAY\",\"\"))","v":""},{"$f":"IF(DAY(DX18)=1,DX18,IF(DX9=HideValues!$D$3,\"TODAY\",\"\"))","v":""},{"$f":"IF(DAY(DY18)=1,DY18,IF(DY9=HideValues!$D$3,\"TODAY\",\"\"))","v":""},{"$f":"IF(DAY(DZ18)=1,DZ18,IF(DZ9=HideValues!$D$3,\"TODAY\",\"\"))","v":""},{"$f":"IF(DAY(EA18)=1,EA18,IF(EA9=HideValues!$D$3,\"TODAY\",\"\"))","v":""},{"$f":"IF(DAY(EB18)=1,EB18,IF(EB9=HideValues!$D$3,\"TODAY\",\"\"))","v":""},{"$f":"IF(DAY(EC18)=1,EC18,IF(EC9=HideValues!$D$3,\"TODAY\",\"\"))","v":""},{"$f":"IF(DAY(ED18)=1,ED18,IF(ED9=HideValues!$D$3,\"TODAY\",\"\"))","v":""},{"$f":"IF(DAY(EE18)=1,EE18,IF(EE9=HideValues!$D$3,\"TODAY\",\"\"))","v":""},{"$f":"IF(DAY(EF18)=1,EF18,IF(EF9=HideValues!$D$3,\"TODAY\",\"\"))","v":""},{"$f":"IF(DAY(EG18)=1,EG18,IF(EG9=HideValues!$D$3,\"TODAY\",\"\"))","v":""},{"$f":"IF(DAY(EH18)=1,EH18,IF(EH9=HideValues!$D$3,\"TODAY\",\"\"))","v":""},{"$f":"IF(DAY(EI18)=1,EI18,IF(EI9=HideValues!$D$3,\"TODAY\",\"\"))","v":""},{"$f":"IF(DAY(EJ18)=1,EJ18,IF(EJ9=HideValues!$D$3,\"TODAY\",\"\"))","v":""},{"$f":"IF(DAY(EK18)=1,EK18,IF(EK9=HideValues!$D$3,\"TODAY\",\"\"))","v":""},{"$f":"IF(DAY(EL18)=1,EL18,IF(EL9=HideValues!$D$3,\"TODAY\",\"\"))","v":""},{"$f":"IF(DAY(EM18)=1,EM18,IF(EM9=HideValues!$D$3,\"TODAY\",\"\"))","v":""},{"$f":"IF(DAY(EN18)=1,EN18,IF(EN9=HideValues!$D$3,\"TODAY\",\"\"))","v":""},{"$f":"IF(DAY(EO18)=1,EO18,IF(EO9=HideValues!$D$3,\"TODAY\",\"\"))","v":""},{"$f":"IF(DAY(EP18)=1,EP18,IF(EP9=HideValues!$D$3,\"TODAY\",\"\"))","v":"2017-03-01"},{"$f":"IF(DAY(EQ18)=1,EQ18,IF(EQ9=HideValues!$D$3,\"TODAY\",\"\"))","v":""},{"$f":"IF(DAY(ER18)=1,ER18,IF(ER9=HideValues!$D$3,\"TODAY\",\"\"))","v":""},{"$f":"IF(DAY(ES18)=1,ES18,IF(ES9=HideValues!$D$3,\"TODAY\",\"\"))","v":""},{"$f":"IF(DAY(ET18)=1,ET18,IF(ET9=HideValues!$D$3,\"TODAY\",\"\"))","v":""},{"$f":"IF(DAY(EU18)=1,EU18,IF(EU9=HideValues!$D$3,\"TODAY\",\"\"))","v":""},{"$f":"IF(DAY(EV18)=1,EV18,IF(EV9=HideValues!$D$3,\"TODAY\",\"\"))","v":""},{"$f":"IF(DAY(EW18)=1,EW18,IF(EW9=HideValues!$D$3,\"TODAY\",\"\"))","v":""},{"$f":"IF(DAY(EX18)=1,EX18,IF(EX9=HideValues!$D$3,\"TODAY\",\"\"))","v":""},{"$f":"IF(DAY(EY18)=1,EY18,IF(EY9=HideValues!$D$3,\"TODAY\",\"\"))","v":""},{"$f":"IF(DAY(EZ18)=1,EZ18,IF(EZ9=HideValues!$D$3,\"TODAY\",\"\"))","v":""},{"$f":"IF(DAY(FA18)=1,FA18,IF(FA9=HideValues!$D$3,\"TODAY\",\"\"))","v":""},{"$f":"IF(DAY(FB18)=1,FB18,IF(FB9=HideValues!$D$3,\"TODAY\",\"\"))","v":""},{"$f":"IF(DAY(FC18)=1,FC18,IF(FC9=HideValues!$D$3,\"TODAY\",\"\"))","v":""},{"$f":"IF(DAY(FD18)=1,FD18,IF(FD9=HideValues!$D$3,\"TODAY\",\"\"))","v":""},{"$f":"IF(DAY(FE18)=1,FE18,IF(FE9=HideValues!$D$3,\"TODAY\",\"\"))","v":""},{"$f":"IF(DAY(FF18)=1,FF18,IF(FF9=HideValues!$D$3,\"TODAY\",\"\"))","v":""},{"$f":"IF(DAY(FG18)=1,FG18,IF(FG9=HideValues!$D$3,\"TODAY\",\"\"))","v":""},{"$f":"IF(DAY(FH18)=1,FH18,IF(FH9=HideValues!$D$3,\"TODAY\",\"\"))","v":""},{"$f":"IF(DAY(FI18)=1,FI18,IF(FI9=HideValues!$D$3,\"TODAY\",\"\"))","v":""},{"$f":"IF(DAY(FJ18)=1,FJ18,IF(FJ9=HideValues!$D$3,\"TODAY\",\"\"))","v":""},{"$f":"IF(DAY(FK18)=1,FK18,IF(FK9=HideValues!$D$3,\"TODAY\",\"\"))","v":""},{"$f":"IF(DAY(FL18)=1,FL18,IF(FL9=HideValues!$D$3,\"TODAY\",\"\"))","v":""},{"$f":"IF(DAY(FM18)=1,FM18,IF(FM9=HideValues!$D$3,\"TODAY\",\"\"))","v":""},{"$f":"IF(DAY(FN18)=1,FN18,IF(FN9=HideValues!$D$3,\"TODAY\",\"\"))","v":""},{"$f":"IF(DAY(FO18)=1,FO18,IF(FO9=HideValues!$D$3,\"TODAY\",\"\"))","v":""},{"$f":"IF(DAY(FP18)=1,FP18,IF(FP9=HideValues!$D$3,\"TODAY\",\"\"))","v":""},{"$f":"IF(DAY(FQ18)=1,FQ18,IF(FQ9=HideValues!$D$3,\"TODAY\",\"\"))","v":""},{"$f":"IF(DAY(FR18)=1,FR18,IF(FR9=HideValues!$D$3,\"TODAY\",\"\"))","v":""},{"$f":"IF(DAY(FS18)=1,FS18,IF(FS9=HideValues!$D$3,\"TODAY\",\"\"))","v":""},{"$f":"IF(DAY(FT18)=1,FT18,IF(FT9=HideValues!$D$3,\"TODAY\",\"\"))","v":""},{"$f":"IF(DAY(FU18)=1,FU18,IF(FU9=HideValues!$D$3,\"TODAY\",\"\"))","v":"2017-04-01"},{"$f":"IF(DAY(FV18)=1,FV18,IF(FV9=HideValues!$D$3,\"TODAY\",\"\"))","v":""},{"$f":"IF(DAY(FW18)=1,FW18,IF(FW9=HideValues!$D$3,\"TODAY\",\"\"))","v":""},{"$f":"IF(DAY(FX18)=1,FX18,IF(FX9=HideValues!$D$3,\"TODAY\",\"\"))","v":""},{"$f":"IF(DAY(FY18)=1,FY18,IF(FY9=HideValues!$D$3,\"TODAY\",\"\"))","v":""},{"$f":"IF(DAY(FZ18)=1,FZ18,IF(FZ9=HideValues!$D$3,\"TODAY\",\"\"))","v":""},{"$f":"IF(DAY(GA18)=1,GA18,IF(GA9=HideValues!$D$3,\"TODAY\",\"\"))","v":""},{"$f":"IF(DAY(GB18)=1,GB18,IF(GB9=HideValues!$D$3,\"TODAY\",\"\"))","v":""},{"$f":"IF(DAY(GC18)=1,GC18,IF(GC9=HideValues!$D$3,\"TODAY\",\"\"))","v":""},{"$f":"IF(DAY(GD18)=1,GD18,IF(GD9=HideValues!$D$3,\"TODAY\",\"\"))","v":""},{"$f":"IF(DAY(GE18)=1,GE18,IF(GE9=HideValues!$D$3,\"TODAY\",\"\"))","v":""},{"$f":"IF(DAY(GF18)=1,GF18,IF(GF9=HideValues!$D$3,\"TODAY\",\"\"))","v":""},{"$f":"IF(DAY(GG18)=1,GG18,IF(GG9=HideValues!$D$3,\"TODAY\",\"\"))","v":""},{"$f":"IF(DAY(GH18)=1,GH18,IF(GH9=HideValues!$D$3,\"TODAY\",\"\"))","v":""},{"$f":"IF(DAY(GI18)=1,GI18,IF(GI9=HideValues!$D$3,\"TODAY\",\"\"))","v":""},{"$f":"IF(DAY(GJ18)=1,GJ18,IF(GJ9=HideValues!$D$3,\"TODAY\",\"\"))","v":""},{"$f":"IF(DAY(GK18)=1,GK18,IF(GK9=HideValues!$D$3,\"TODAY\",\"\"))","v":""},{"$f":"IF(DAY(GL18)=1,GL18,IF(GL9=HideValues!$D$3,\"TODAY\",\"\"))","v":""},{"$f":"IF(DAY(GM18)=1,GM18,IF(GM9=HideValues!$D$3,\"TODAY\",\"\"))","v":""},{"$f":"IF(DAY(GN18)=1,GN18,IF(GN9=HideValues!$D$3,\"TODAY\",\"\"))","v":""},{"$f":"IF(DAY(GO18)=1,GO18,IF(GO9=HideValues!$D$3,\"TODAY\",\"\"))","v":""},{"$f":"IF(DAY(GP18)=1,GP18,IF(GP9=HideValues!$D$3,\"TODAY\",\"\"))","v":""},{"$f":"IF(DAY(GQ18)=1,GQ18,IF(GQ9=HideValues!$D$3,\"TODAY\",\"\"))","v":""},{"$f":"IF(DAY(GR18)=1,GR18,IF(GR9=HideValues!$D$3,\"TODAY\",\"\"))","v":""},{"$f":"IF(DAY(GS18)=1,GS18,IF(GS9=HideValues!$D$3,\"TODAY\",\"\"))","v":""},{"$f":"IF(DAY(GT18)=1,GT18,IF(GT9=HideValues!$D$3,\"TODAY\",\"\"))","v":""},{"$f":"IF(DAY(GU18)=1,GU18,IF(GU9=HideValues!$D$3,\"TODAY\",\"\"))","v":""},{"$f":"IF(DAY(GV18)=1,GV18,IF(GV9=HideValues!$D$3,\"TODAY\",\"\"))","v":""},{"$f":"IF(DAY(GW18)=1,GW18,IF(GW9=HideValues!$D$3,\"TODAY\",\"\"))","v":""},{"$f":"IF(DAY(GX18)=1,GX18,IF(GX9=HideValues!$D$3,\"TODAY\",\"\"))","v":""},{"$f":"IF(DAY(GY18)=1,GY18,IF(GY9=HideValues!$D$3,\"TODAY\",\"\"))","v":"2017-05-01"},{"$f":"IF(DAY(GZ18)=1,GZ18,IF(GZ9=HideValues!$D$3,\"TODAY\",\"\"))","v":""},{"$f":"IF(DAY(HA18)=1,HA18,IF(HA9=HideValues!$D$3,\"TODAY\",\"\"))","v":""},{"$f":"IF(DAY(HB18)=1,HB18,IF(HB9=HideValues!$D$3,\"TODAY\",\"\"))","v":""},{"$f":"IF(DAY(HC18)=1,HC18,IF(HC9=HideValues!$D$3,\"TODAY\",\"\"))","v":""},{"$f":"IF(DAY(HD18)=1,HD18,IF(HD9=HideValues!$D$3,\"TODAY\",\"\"))","v":""},{"$f":"IF(DAY(HE18)=1,HE18,IF(HE9=HideValues!$D$3,\"TODAY\",\"\"))","v":""},{"$f":"IF(DAY(HF18)=1,HF18,IF(HF9=HideValues!$D$3,\"TODAY\",\"\"))","v":""},{"$f":"IF(DAY(HG18)=1,HG18,IF(HG9=HideValues!$D$3,\"TODAY\",\"\"))","v":""},{"$f":"IF(DAY(HH18)=1,HH18,IF(HH9=HideValues!$D$3,\"TODAY\",\"\"))","v":""},{"$f":"IF(DAY(HI18)=1,HI18,IF(HI9=HideValues!$D$3,\"TODAY\",\"\"))","v":""},{"$f":"IF(DAY(HJ18)=1,HJ18,IF(HJ9=HideValues!$D$3,\"TODAY\",\"\"))","v":""},{"$f":"IF(DAY(HK18)=1,HK18,IF(HK9=HideValues!$D$3,\"TODAY\",\"\"))","v":""},{"$f":"IF(DAY(HL18)=1,HL18,IF(HL9=HideValues!$D$3,\"TODAY\",\"\"))","v":""},{"$f":"IF(DAY(HM18)=1,HM18,IF(HM9=HideValues!$D$3,\"TODAY\",\"\"))","v":""},{"$f":"IF(DAY(HN18)=1,HN18,IF(HN9=HideValues!$D$3,\"TODAY\",\"\"))","v":""},{"$f":"IF(DAY(HO18)=1,HO18,IF(HO9=HideValues!$D$3,\"TODAY\",\"\"))","v":""},{"$f":"IF(DAY(HP18)=1,HP18,IF(HP9=HideValues!$D$3,\"TODAY\",\"\"))","v":""},{"$f":"IF(DAY(HQ18)=1,HQ18,IF(HQ9=HideValues!$D$3,\"TODAY\",\"\"))","v":""},{"$f":"IF(DAY(HR18)=1,HR18,IF(HR9=HideValues!$D$3,\"TODAY\",\"\"))","v":""},{"$f":"IF(DAY(HS18)=1,HS18,IF(HS9=HideValues!$D$3,\"TODAY\",\"\"))","v":""},{"$f":"IF(DAY(HT18)=1,HT18,IF(HT9=HideValues!$D$3,\"TODAY\",\"\"))","v":""},{"$f":"IF(DAY(HU18)=1,HU18,IF(HU9=HideValues!$D$3,\"TODAY\",\"\"))","v":""},{"$f":"IF(DAY(HV18)=1,HV18,IF(HV9=HideValues!$D$3,\"TODAY\",\"\"))","v":""},{"$f":"IF(DAY(HW18)=1,HW18,IF(HW9=HideValues!$D$3,\"TODAY\",\"\"))","v":""},{"$f":"IF(DAY(HX18)=1,HX18,IF(HX9=HideValues!$D$3,\"TODAY\",\"\"))","v":""},{"$f":"IF(DAY(HY18)=1,HY18,IF(HY9=HideValues!$D$3,\"TODAY\",\"\"))","v":""},{"$f":"IF(DAY(HZ18)=1,HZ18,IF(HZ9=HideValues!$D$3,\"TODAY\",\"\"))","v":""},{"$f":"IF(DAY(IA18)=1,IA18,IF(IA9=HideValues!$D$3,\"TODAY\",\"\"))","v":""},{"$f":"IF(DAY(IB18)=1,IB18,IF(IB9=HideValues!$D$3,\"TODAY\",\"\"))","v":""},{"$f":"IF(DAY(IC18)=1,IC18,IF(IC9=HideValues!$D$3,\"TODAY\",\"\"))","v":""},{"$f":"IF(DAY(ID18)=1,ID18,IF(ID9=HideValues!$D$3,\"TODAY\",\"\"))","v":"2017-06-01"},{"$f":"IF(DAY(IE18)=1,IE18,IF(IE9=HideValues!$D$3,\"TODAY\",\"\"))","v":""},{"$f":"IF(DAY(IF18)=1,IF18,IF(IF9=HideValues!$D$3,\"TODAY\",\"\"))","v":""},{"$f":"IF(DAY(IG18)=1,IG18,IF(IG9=HideValues!$D$3,\"TODAY\",\"\"))","v":""},{"$f":"IF(DAY(IH18)=1,IH18,IF(IH9=HideValues!$D$3,\"TODAY\",\"\"))","v":""},{"$f":"IF(DAY(II18)=1,II18,IF(II9=HideValues!$D$3,\"TODAY\",\"\"))","v":""},{"$f":"IF(DAY(IJ18)=1,IJ18,IF(IJ9=HideValues!$D$3,\"TODAY\",\"\"))","v":""},{"$f":"IF(DAY(IK18)=1,IK18,IF(IK9=HideValues!$D$3,\"TODAY\",\"\"))","v":""},{"$f":"IF(DAY(IL18)=1,IL18,IF(IL9=HideValues!$D$3,\"TODAY\",\"\"))","v":""},{"$f":"IF(DAY(IM18)=1,IM18,IF(IM9=HideValues!$D$3,\"TODAY\",\"\"))","v":""},{"$f":"IF(DAY(IN18)=1,IN18,IF(IN9=HideValues!$D$3,\"TODAY\",\"\"))","v":""},{"$f":"IF(DAY(IO18)=1,IO18,IF(IO9=HideValues!$D$3,\"TODAY\",\"\"))","v":""},{"$f":"IF(DAY(IP18)=1,IP18,IF(IP9=HideValues!$D$3,\"TODAY\",\"\"))","v":""},{"$f":"IF(DAY(IQ18)=1,IQ18,IF(IQ9=HideValues!$D$3,\"TODAY\",\"\"))","v":""},{"$f":"IF(DAY(IR18)=1,IR18,IF(IR9=HideValues!$D$3,\"TODAY\",\"\"))","v":""},{"$f":"IF(DAY(IS18)=1,IS18,IF(IS9=HideValues!$D$3,\"TODAY\",\"\"))","v":""},{"$f":"IF(DAY(IT18)=1,IT18,IF(IT9=HideValues!$D$3,\"TODAY\",\"\"))","v":""},{"$f":"IF(DAY(IU18)=1,IU18,IF(IU9=HideValues!$D$3,\"TODAY\",\"\"))","v":""},{"$f":"IF(DAY(IV18)=1,IV18,IF(IV9=HideValues!$D$3,\"TODAY\",\"\"))","v":""},{"$f":"IF(DAY(IW18)=1,IW18,IF(IW9=HideValues!$D$3,\"TODAY\",\"\"))","v":""},{"$f":"IF(DAY(IX18)=1,IX18,IF(IX9=HideValues!$D$3,\"TODAY\",\"\"))","v":""},{"$f":"IF(DAY(IY18)=1,IY18,IF(IY9=HideValues!$D$3,\"TODAY\",\"\"))","v":""},{"$f":"IF(DAY(IZ18)=1,IZ18,IF(IZ9=HideValues!$D$3,\"TODAY\",\"\"))","v":""},{"$f":"IF(DAY(JA18)=1,JA18,IF(JA9=HideValues!$D$3,\"TODAY\",\"\"))","v":""},{"$f":"IF(DAY(JB18)=1,JB18,IF(JB9=HideValues!$D$3,\"TODAY\",\"\"))","v":""},{"$f":"IF(DAY(JC18)=1,JC18,IF(JC9=HideValues!$D$3,\"TODAY\",\"\"))","v":""},{"$f":"IF(DAY(JD18)=1,JD18,IF(JD9=HideValues!$D$3,\"TODAY\",\"\"))","v":""},{"$f":"IF(DAY(JE18)=1,JE18,IF(JE9=HideValues!$D$3,\"TODAY\",\"\"))","v":""},{"$f":"IF(DAY(JF18)=1,JF18,IF(JF9=HideValues!$D$3,\"TODAY\",\"\"))","v":""},{"$f":"IF(DAY(JG18)=1,JG18,IF(JG9=HideValues!$D$3,\"TODAY\",\"\"))","v":""},{"$f":"IF(DAY(JH18)=1,JH18,IF(JH9=HideValues!$D$3,\"TODAY\",\"\"))","v":"2017-07-01"},{"$f":"IF(DAY(JI18)=1,JI18,IF(JI9=HideValues!$D$3,\"TODAY\",\"\"))","v":""},{"$f":"IF(DAY(JJ18)=1,JJ18,IF(JJ9=HideValues!$D$3,\"TODAY\",\"\"))","v":""},{"$f":"IF(DAY(JK18)=1,JK18,IF(JK9=HideValues!$D$3,\"TODAY\",\"\"))","v":""},{"$f":"IF(DAY(JL18)=1,JL18,IF(JL9=HideValues!$D$3,\"TODAY\",\"\"))","v":""},{"$f":"IF(DAY(JM18)=1,JM18,IF(JM9=HideValues!$D$3,\"TODAY\",\"\"))","v":""},{"$f":"IF(DAY(JN18)=1,JN18,IF(JN9=HideValues!$D$3,\"TODAY\",\"\"))","v":""},{"$f":"IF(DAY(JO18)=1,JO18,IF(JO9=HideValues!$D$3,\"TODAY\",\"\"))","v":""},{"$f":"IF(DAY(JP18)=1,JP18,IF(JP9=HideValues!$D$3,\"TODAY\",\"\"))","v":""},{"$f":"IF(DAY(JQ18)=1,JQ18,IF(JQ9=HideValues!$D$3,\"TODAY\",\"\"))","v":""},{"$f":"IF(DAY(JR18)=1,JR18,IF(JR9=HideValues!$D$3,\"TODAY\",\"\"))","v":""},{"$f":"IF(DAY(JS18)=1,JS18,IF(JS9=HideValues!$D$3,\"TODAY\",\"\"))","v":""},{"$f":"IF(DAY(JT18)=1,JT18,IF(JT9=HideValues!$D$3,\"TODAY\",\"\"))","v":""},{"$f":"IF(DAY(JU18)=1,JU18,IF(JU9=HideValues!$D$3,\"TODAY\",\"\"))","v":""},{"$f":"IF(DAY(JV18)=1,JV18,IF(JV9=HideValues!$D$3,\"TODAY\",\"\"))","v":""},{"$f":"IF(DAY(JW18)=1,JW18,IF(JW9=HideValues!$D$3,\"TODAY\",\"\"))","v":""},{"$f":"IF(DAY(JX18)=1,JX18,IF(JX9=HideValues!$D$3,\"TODAY\",\"\"))","v":""},{"$f":"IF(DAY(JY18)=1,JY18,IF(JY9=HideValues!$D$3,\"TODAY\",\"\"))","v":""},{"$f":"IF(DAY(JZ18)=1,JZ18,IF(JZ9=HideValues!$D$3,\"TODAY\",\"\"))","v":""},{"$f":"IF(DAY(KA18)=1,KA18,IF(KA9=HideValues!$D$3,\"TODAY\",\"\"))","v":""},{"$f":"IF(DAY(KB18)=1,KB18,IF(KB9=HideValues!$D$3,\"TODAY\",\"\"))","v":""},{"$f":"IF(DAY(KC18)=1,KC18,IF(KC9=HideValues!$D$3,\"TODAY\",\"\"))","v":""},{"$f":"IF(DAY(KD18)=1,KD18,IF(KD9=HideValues!$D$3,\"TODAY\",\"\"))","v":""},{"$f":"IF(DAY(KE18)=1,KE18,IF(KE9=HideValues!$D$3,\"TODAY\",\"\"))","v":""},{"$f":"IF(DAY(KF18)=1,KF18,IF(KF9=HideValues!$D$3,\"TODAY\",\"\"))","v":""},{"$f":"IF(DAY(KG18)=1,KG18,IF(KG9=HideValues!$D$3,\"TODAY\",\"\"))","v":""},{"$f":"IF(DAY(KH18)=1,KH18,IF(KH9=HideValues!$D$3,\"TODAY\",\"\"))","v":""},{"$f":"IF(DAY(KI18)=1,KI18,IF(KI9=HideValues!$D$3,\"TODAY\",\"\"))","v":""},{"$f":"IF(DAY(KJ18)=1,KJ18,IF(KJ9=HideValues!$D$3,\"TODAY\",\"\"))","v":""},{"$f":"IF(DAY(KK18)=1,KK18,IF(KK9=HideValues!$D$3,\"TODAY\",\"\"))","v":""},{"$f":"IF(DAY(KL18)=1,KL18,IF(KL9=HideValues!$D$3,\"TODAY\",\"\"))","v":""},{"$f":"IF(DAY(KM18)=1,KM18,IF(KM9=HideValues!$D$3,\"TODAY\",\"\"))","v":"2017-08-01"},{"$f":"IF(DAY(KN18)=1,KN18,IF(KN9=HideValues!$D$3,\"TODAY\",\"\"))","v":""},{"$f":"IF(DAY(KO18)=1,KO18,IF(KO9=HideValues!$D$3,\"TODAY\",\"\"))","v":""},{"$f":"IF(DAY(KP18)=1,KP18,IF(KP9=HideValues!$D$3,\"TODAY\",\"\"))","v":""},{"$f":"IF(DAY(KQ18)=1,KQ18,IF(KQ9=HideValues!$D$3,\"TODAY\",\"\"))","v":""},{"$f":"IF(DAY(KR18)=1,KR18,IF(KR9=HideValues!$D$3,\"TODAY\",\"\"))","v":""},{"$f":"IF(DAY(KS18)=1,KS18,IF(KS9=HideValues!$D$3,\"TODAY\",\"\"))","v":""},{"$f":"IF(DAY(KT18)=1,KT18,IF(KT9=HideValues!$D$3,\"TODAY\",\"\"))","v":""},{"$f":"IF(DAY(KU18)=1,KU18,IF(KU9=HideValues!$D$3,\"TODAY\",\"\"))","v":""},{"$f":"IF(DAY(KV18)=1,KV18,IF(KV9=HideValues!$D$3,\"TODAY\",\"\"))","v":""},{"$f":"IF(DAY(KW18)=1,KW18,IF(KW9=HideValues!$D$3,\"TODAY\",\"\"))","v":""},{"$f":"IF(DAY(KX18)=1,KX18,IF(KX9=HideValues!$D$3,\"TODAY\",\"\"))","v":""},{"$f":"IF(DAY(KY18)=1,KY18,IF(KY9=HideValues!$D$3,\"TODAY\",\"\"))","v":""},{"$f":"IF(DAY(KZ18)=1,KZ18,IF(KZ9=HideValues!$D$3,\"TODAY\",\"\"))","v":""},{"$f":"IF(DAY(LA18)=1,LA18,IF(LA9=HideValues!$D$3,\"TODAY\",\"\"))","v":""},{"$f":"IF(DAY(LB18)=1,LB18,IF(LB9=HideValues!$D$3,\"TODAY\",\"\"))","v":""},{"$f":"IF(DAY(LC18)=1,LC18,IF(LC9=HideValues!$D$3,\"TODAY\",\"\"))","v":""},{"$f":"IF(DAY(LD18)=1,LD18,IF(LD9=HideValues!$D$3,\"TODAY\",\"\"))","v":""},{"$f":"IF(DAY(LE18)=1,LE18,IF(LE9=HideValues!$D$3,\"TODAY\",\"\"))","v":""},{"$f":"IF(DAY(LF18)=1,LF18,IF(LF9=HideValues!$D$3,\"TODAY\",\"\"))","v":""},{"$f":"IF(DAY(LG18)=1,LG18,IF(LG9=HideValues!$D$3,\"TODAY\",\"\"))","v":""},{"$f":"IF(DAY(LH18)=1,LH18,IF(LH9=HideValues!$D$3,\"TODAY\",\"\"))","v":""},{"$f":"IF(DAY(LI18)=1,LI18,IF(LI9=HideValues!$D$3,\"TODAY\",\"\"))","v":""},{"$f":"IF(DAY(LJ18)=1,LJ18,IF(LJ9=HideValues!$D$3,\"TODAY\",\"\"))","v":""},{"$f":"IF(DAY(LK18)=1,LK18,IF(LK9=HideValues!$D$3,\"TODAY\",\"\"))","v":""},{"$f":"IF(DAY(LL18)=1,LL18,IF(LL9=HideValues!$D$3,\"TODAY\",\"\"))","v":""},{"$f":"IF(DAY(LM18)=1,LM18,IF(LM9=HideValues!$D$3,\"TODAY\",\"\"))","v":""},{"$f":"IF(DAY(LN18)=1,LN18,IF(LN9=HideValues!$D$3,\"TODAY\",\"\"))","v":""},{"$f":"IF(DAY(LO18)=1,LO18,IF(LO9=HideValues!$D$3,\"TODAY\",\"\"))","v":""},{"$f":"IF(DAY(LP18)=1,LP18,IF(LP9=HideValues!$D$3,\"TODAY\",\"\"))","v":""},{"$f":"IF(DAY(LQ18)=1,LQ18,IF(LQ9=HideValues!$D$3,\"TODAY\",\"\"))","v":""},{"$f":"IF(DAY(LR18)=1,LR18,IF(LR9=HideValues!$D$3,\"TODAY\",\"\"))","v":"2017-09-01"},{"$f":"IF(DAY(LS18)=1,LS18,IF(LS9=HideValues!$D$3,\"TODAY\",\"\"))","v":""},{"$f":"IF(DAY(LT18)=1,LT18,IF(LT9=HideValues!$D$3,\"TODAY\",\"\"))","v":""},{"$f":"IF(DAY(LU18)=1,LU18,IF(LU9=HideValues!$D$3,\"TODAY\",\"\"))","v":""},{"$f":"IF(DAY(LV18)=1,LV18,IF(LV9=HideValues!$D$3,\"TODAY\",\"\"))","v":""},{"$f":"IF(DAY(LW18)=1,LW18,IF(LW9=HideValues!$D$3,\"TODAY\",\"\"))","v":""},{"$f":"IF(DAY(LX18)=1,LX18,IF(LX9=HideValues!$D$3,\"TODAY\",\"\"))","v":""},{"$f":"IF(DAY(LY18)=1,LY18,IF(LY9=HideValues!$D$3,\"TODAY\",\"\"))","v":""},{"$f":"IF(DAY(LZ18)=1,LZ18,IF(LZ9=HideValues!$D$3,\"TODAY\",\"\"))","v":""},{"$f":"IF(DAY(MA18)=1,MA18,IF(MA9=HideValues!$D$3,\"TODAY\",\"\"))","v":""},{"$f":"IF(DAY(MB18)=1,MB18,IF(MB9=HideValues!$D$3,\"TODAY\",\"\"))","v":""},{"$f":"IF(DAY(MC18)=1,MC18,IF(MC9=HideValues!$D$3,\"TODAY\",\"\"))","v":""},{"$f":"IF(DAY(MD18)=1,MD18,IF(MD9=HideValues!$D$3,\"TODAY\",\"\"))","v":""},{"$f":"IF(DAY(ME18)=1,ME18,IF(ME9=HideValues!$D$3,\"TODAY\",\"\"))","v":""},{"$f":"IF(DAY(MF18)=1,MF18,IF(MF9=HideValues!$D$3,\"TODAY\",\"\"))","v":""},{"$f":"IF(DAY(MG18)=1,MG18,IF(MG9=HideValues!$D$3,\"TODAY\",\"\"))","v":""},{"$f":"IF(DAY(MH18)=1,MH18,IF(MH9=HideValues!$D$3,\"TODAY\",\"\"))","v":""},{"$f":"IF(DAY(MI18)=1,MI18,IF(MI9=HideValues!$D$3,\"TODAY\",\"\"))","v":""},{"$f":"IF(DAY(MJ18)=1,MJ18,IF(MJ9=HideValues!$D$3,\"TODAY\",\"\"))","v":""},{"$f":"IF(DAY(MK18)=1,MK18,IF(MK9=HideValues!$D$3,\"TODAY\",\"\"))","v":""},{"$f":"IF(DAY(ML18)=1,ML18,IF(ML9=HideValues!$D$3,\"TODAY\",\"\"))","v":""},{"$f":"IF(DAY(MM18)=1,MM18,IF(MM9=HideValues!$D$3,\"TODAY\",\"\"))","v":""},{"$f":"IF(DAY(MN18)=1,MN18,IF(MN9=HideValues!$D$3,\"TODAY\",\"\"))","v":""},{"$f":"IF(DAY(MO18)=1,MO18,IF(MO9=HideValues!$D$3,\"TODAY\",\"\"))","v":""},{"$f":"IF(DAY(MP18)=1,MP18,IF(MP9=HideValues!$D$3,\"TODAY\",\"\"))","v":""},{"$f":"IF(DAY(MQ18)=1,MQ18,IF(MQ9=HideValues!$D$3,\"TODAY\",\"\"))","v":""},{"$f":"IF(DAY(MR18)=1,MR18,IF(MR9=HideValues!$D$3,\"TODAY\",\"\"))","v":""},{"$f":"IF(DAY(MS18)=1,MS18,IF(MS9=HideValues!$D$3,\"TODAY\",\"\"))","v":""},{"$f":"IF(DAY(MT18)=1,MT18,IF(MT9=HideValues!$D$3,\"TODAY\",\"\"))","v":""},{"$f":"IF(DAY(MU18)=1,MU18,IF(MU9=HideValues!$D$3,\"TODAY\",\"\"))","v":""},{"$f":"IF(DAY(MV18)=1,MV18,IF(MV9=HideValues!$D$3,\"TODAY\",\"\"))","v":"2017-10-01"},{"$f":"IF(DAY(MW18)=1,MW18,IF(MW9=HideValues!$D$3,\"TODAY\",\"\"))","v":""},{"$f":"IF(DAY(MX18)=1,MX18,IF(MX9=HideValues!$D$3,\"TODAY\",\"\"))","v":""},{"$f":"IF(DAY(MY18)=1,MY18,IF(MY9=HideValues!$D$3,\"TODAY\",\"\"))","v":""},{"$f":"IF(DAY(MZ18)=1,MZ18,IF(MZ9=HideValues!$D$3,\"TODAY\",\"\"))","v":""},{"$f":"IF(DAY(NA18)=1,NA18,IF(NA9=HideValues!$D$3,\"TODAY\",\"\"))","v":""},{"$f":"IF(DAY(NB18)=1,NB18,IF(NB9=HideValues!$D$3,\"TODAY\",\"\"))","v":""},{"$f":"IF(DAY(NC18)=1,NC18,IF(NC9=HideValues!$D$3,\"TODAY\",\"\"))","v":""},{"$f":"IF(DAY(ND18)=1,ND18,IF(ND9=HideValues!$D$3,\"TODAY\",\"\"))","v":""},{"$f":"IF(DAY(NE18)=1,NE18,IF(NE9=HideValues!$D$3,\"TODAY\",\"\"))","v":""},{"$f":"IF(DAY(NF18)=1,NF18,IF(NF9=HideValues!$D$3,\"TODAY\",\"\"))","v":""},{"$f":"IF(DAY(NG18)=1,NG18,IF(NG9=HideValues!$D$3,\"TODAY\",\"\"))","v":""},{"$f":"IF(DAY(NH18)=1,NH18,IF(NH9=HideValues!$D$3,\"TODAY\",\"\"))","v":""},{"$f":"IF(DAY(NI18)=1,NI18,IF(NI9=HideValues!$D$3,\"TODAY\",\"\"))","v":""},{"$f":"IF(DAY(NJ18)=1,NJ18,IF(NJ9=HideValues!$D$3,\"TODAY\",\"\"))","v":""},{"$f":"IF(DAY(NK18)=1,NK18,IF(NK9=HideValues!$D$3,\"TODAY\",\"\"))","v":""},{"$f":"IF(DAY(NL18)=1,NL18,IF(NL9=HideValues!$D$3,\"TODAY\",\"\"))","v":""},{"$f":"IF(DAY(NM18)=1,NM18,IF(NM9=HideValues!$D$3,\"TODAY\",\"\"))","v":""},{"$f":"IF(DAY(NN18)=1,NN18,IF(NN9=HideValues!$D$3,\"TODAY\",\"\"))","v":""},{"$f":"IF(DAY(NO18)=1,NO18,IF(NO9=HideValues!$D$3,\"TODAY\",\"\"))","v":""},{"$f":"IF(DAY(NP18)=1,NP18,IF(NP9=HideValues!$D$3,\"TODAY\",\"\"))","v":""},{"$f":"IF(DAY(NQ18)=1,NQ18,IF(NQ9=HideValues!$D$3,\"TODAY\",\"\"))","v":""},{"$f":"IF(DAY(NR18)=1,NR18,IF(NR9=HideValues!$D$3,\"TODAY\",\"\"))","v":""},{"$f":"IF(DAY(NS18)=1,NS18,IF(NS9=HideValues!$D$3,\"TODAY\",\"\"))","v":""},{"$f":"IF(DAY(NT18)=1,NT18,IF(NT9=HideValues!$D$3,\"TODAY\",\"\"))","v":""},{"$f":"IF(DAY(NU18)=1,NU18,IF(NU9=HideValues!$D$3,\"TODAY\",\"\"))","v":""},{"$f":"IF(DAY(NV18)=1,NV18,IF(NV9=HideValues!$D$3,\"TODAY\",\"\"))","v":""},{"$f":"IF(DAY(NW18)=1,NW18,IF(NW9=HideValues!$D$3,\"TODAY\",\"\"))","v":""},{"$f":"IF(DAY(NX18)=1,NX18,IF(NX9=HideValues!$D$3,\"TODAY\",\"\"))","v":""},{"$f":"IF(DAY(NY18)=1,NY18,IF(NY9=HideValues!$D$3,\"TODAY\",\"\"))","v":""},{"$f":"IF(DAY(NZ18)=1,NZ18,IF(NZ9=HideValues!$D$3,\"TODAY\",\"\"))","v":""},{"$f":"IF(DAY(OA18)=1,OA18,IF(OA9=HideValues!$D$3,\"TODAY\",\"\"))","v":"2017-11-01"},{"$f":"IF(DAY(OB18)=1,OB18,IF(OB9=HideValues!$D$3,\"TODAY\",\"\"))","v":""},{"$f":"IF(DAY(OC18)=1,OC18,IF(OC9=HideValues!$D$3,\"TODAY\",\"\"))","v":""},{"$f":"IF(DAY(OD18)=1,OD18,IF(OD9=HideValues!$D$3,\"TODAY\",\"\"))","v":""},{"$f":"IF(DAY(OE18)=1,OE18,IF(OE9=HideValues!$D$3,\"TODAY\",\"\"))","v":""},{"$f":"IF(DAY(OF18)=1,OF18,IF(OF9=HideValues!$D$3,\"TODAY\",\"\"))","v":""},{"$f":"IF(DAY(OG18)=1,OG18,IF(OG9=HideValues!$D$3,\"TODAY\",\"\"))","v":""},{"$f":"IF(DAY(OH18)=1,OH18,IF(OH9=HideValues!$D$3,\"TODAY\",\"\"))","v":""},{"$f":"IF(DAY(OI18)=1,OI18,IF(OI9=HideValues!$D$3,\"TODAY\",\"\"))","v":""},{"$f":"IF(DAY(OJ18)=1,OJ18,IF(OJ9=HideValues!$D$3,\"TODAY\",\"\"))","v":""},{"$f":"IF(DAY(OK18)=1,OK18,IF(OK9=HideValues!$D$3,\"TODAY\",\"\"))","v":""},{"$f":"IF(DAY(OL18)=1,OL18,IF(OL9=HideValues!$D$3,\"TODAY\",\"\"))","v":""},{"$f":"IF(DAY(OM18)=1,OM18,IF(OM9=HideValues!$D$3,\"TODAY\",\"\"))","v":""},{"$f":"IF(DAY(ON18)=1,ON18,IF(ON9=HideValues!$D$3,\"TODAY\",\"\"))","v":""},{"$f":"IF(DAY(OO18)=1,OO18,IF(OO9=HideValues!$D$3,\"TODAY\",\"\"))","v":""},{"$f":"IF(DAY(OP18)=1,OP18,IF(OP9=HideValues!$D$3,\"TODAY\",\"\"))","v":""},{"$f":"IF(DAY(OQ18)=1,OQ18,IF(OQ9=HideValues!$D$3,\"TODAY\",\"\"))","v":""},{"$f":"IF(DAY(OR18)=1,OR18,IF(OR9=HideValues!$D$3,\"TODAY\",\"\"))","v":""},{"$f":"IF(DAY(OS18)=1,OS18,IF(OS9=HideValues!$D$3,\"TODAY\",\"\"))","v":""},{"$f":"IF(DAY(OT18)=1,OT18,IF(OT9=HideValues!$D$3,\"TODAY\",\"\"))","v":""},{"$f":"IF(DAY(OU18)=1,OU18,IF(OU9=HideValues!$D$3,\"TODAY\",\"\"))","v":""},{"$f":"IF(DAY(OV18)=1,OV18,IF(OV9=HideValues!$D$3,\"TODAY\",\"\"))","v":""},{"$f":"IF(DAY(OW18)=1,OW18,IF(OW9=HideValues!$D$3,\"TODAY\",\"\"))","v":""},{"$f":"IF(DAY(OX18)=1,OX18,IF(OX9=HideValues!$D$3,\"TODAY\",\"\"))","v":""},{"$f":"IF(DAY(OY18)=1,OY18,IF(OY9=HideValues!$D$3,\"TODAY\",\"\"))","v":""},{"$f":"IF(DAY(OZ18)=1,OZ18,IF(OZ9=HideValues!$D$3,\"TODAY\",\"\"))","v":""},{"$f":"IF(DAY(PA18)=1,PA18,IF(PA9=HideValues!$D$3,\"TODAY\",\"\"))","v":""},{"$f":"IF(DAY(PB18)=1,PB18,IF(PB9=HideValues!$D$3,\"TODAY\",\"\"))","v":""},{"$f":"IF(DAY(PC18)=1,PC18,IF(PC9=HideValues!$D$3,\"TODAY\",\"\"))","v":""},{"$f":"IF(DAY(PD18)=1,PD18,IF(PD9=HideValues!$D$3,\"TODAY\",\"\"))","v":""},{"$f":"IF(DAY(PE18)=1,PE18,IF(PE9=HideValues!$D$3,\"TODAY\",\"\"))","v":"2017-12-01"},{"$f":"IF(DAY(PF18)=1,PF18,IF(PF9=HideValues!$D$3,\"TODAY\",\"\"))","v":""},{"$f":"IF(DAY(PG18)=1,PG18,IF(PG9=HideValues!$D$3,\"TODAY\",\"\"))","v":""},{"$f":"IF(DAY(PH18)=1,PH18,IF(PH9=HideValues!$D$3,\"TODAY\",\"\"))","v":""},{"$f":"IF(DAY(PI18)=1,PI18,IF(PI9=HideValues!$D$3,\"TODAY\",\"\"))","v":""},{"$f":"IF(DAY(PJ18)=1,PJ18,IF(PJ9=HideValues!$D$3,\"TODAY\",\"\"))","v":""},{"$f":"IF(DAY(PK18)=1,PK18,IF(PK9=HideValues!$D$3,\"TODAY\",\"\"))","v":""},{"$f":"IF(DAY(PL18)=1,PL18,IF(PL9=HideValues!$D$3,\"TODAY\",\"\"))","v":""},{"$f":"IF(DAY(PM18)=1,PM18,IF(PM9=HideValues!$D$3,\"TODAY\",\"\"))","v":""},{"$f":"IF(DAY(PN18)=1,PN18,IF(PN9=HideValues!$D$3,\"TODAY\",\"\"))","v":""},{"$f":"IF(DAY(PO18)=1,PO18,IF(PO9=HideValues!$D$3,\"TODAY\",\"\"))","v":""},{"$f":"IF(DAY(PP18)=1,PP18,IF(PP9=HideValues!$D$3,\"TODAY\",\"\"))","v":""},{"$f":"IF(DAY(PQ18)=1,PQ18,IF(PQ9=HideValues!$D$3,\"TODAY\",\"\"))","v":""},{"$f":"IF(DAY(PR18)=1,PR18,IF(PR9=HideValues!$D$3,\"TODAY\",\"\"))","v":""},{"$f":"IF(DAY(PS18)=1,PS18,IF(PS9=HideValues!$D$3,\"TODAY\",\"\"))","v":""},{"$f":"IF(DAY(PT18)=1,PT18,IF(PT9=HideValues!$D$3,\"TODAY\",\"\"))","v":""},{"$f":"IF(DAY(PU18)=1,PU18,IF(PU9=HideValues!$D$3,\"TODAY\",\"\"))","v":""},{"$f":"IF(DAY(PV18)=1,PV18,IF(PV9=HideValues!$D$3,\"TODAY\",\"\"))","v":""},{"$f":"IF(DAY(PW18)=1,PW18,IF(PW9=HideValues!$D$3,\"TODAY\",\"\"))","v":""},{"$f":"IF(DAY(PX18)=1,PX18,IF(PX9=HideValues!$D$3,\"TODAY\",\"\"))","v":""},{"$f":"IF(DAY(PY18)=1,PY18,IF(PY9=HideValues!$D$3,\"TODAY\",\"\"))","v":""},{"$f":"IF(DAY(PZ18)=1,PZ18,IF(PZ9=HideValues!$D$3,\"TODAY\",\"\"))","v":""},{"$f":"IF(DAY(QA18)=1,QA18,IF(QA9=HideValues!$D$3,\"TODAY\",\"\"))","v":""},{"$f":"IF(DAY(QB18)=1,QB18,IF(QB9=HideValues!$D$3,\"TODAY\",\"\"))","v":""},{"$f":"IF(DAY(QC18)=1,QC18,IF(QC9=HideValues!$D$3,\"TODAY\",\"\"))","v":""},{"$f":"IF(DAY(QD18)=1,QD18,IF(QD9=HideValues!$D$3,\"TODAY\",\"\"))","v":""},{"$f":"IF(DAY(QE18)=1,QE18,IF(QE9=HideValues!$D$3,\"TODAY\",\"\"))","v":""},{"$f":"IF(DAY(QF18)=1,QF18,IF(QF9=HideValues!$D$3,\"TODAY\",\"\"))","v":""},{"$f":"IF(DAY(QG18)=1,QG18,IF(QG9=HideValues!$D$3,\"TODAY\",\"\"))","v":""},{"$f":"IF(DAY(QH18)=1,QH18,IF(QH9=HideValues!$D$3,\"TODAY\",\"\"))","v":""},{"$f":"IF(DAY(QI18)=1,QI18,IF(QI9=HideValues!$D$3,\"TODAY\",\"\"))","v":""},{"$f":"IF(DAY(QJ18)=1,QJ18,IF(QJ9=HideValues!$D$3,\"TODAY\",\"\"))","v":"2018-01-01"},{"$f":"IF(DAY(QK18)=1,QK18,IF(QK9=HideValues!$D$3,\"TODAY\",\"\"))","v":""},{"$f":"IF(DAY(QL18)=1,QL18,IF(QL9=HideValues!$D$3,\"TODAY\",\"\"))","v":""},{"$f":"IF(DAY(QM18)=1,QM18,IF(QM9=HideValues!$D$3,\"TODAY\",\"\"))","v":""},{"$f":"IF(DAY(QN18)=1,QN18,IF(QN9=HideValues!$D$3,\"TODAY\",\"\"))","v":""},{"$f":"IF(DAY(QO18)=1,QO18,IF(QO9=HideValues!$D$3,\"TODAY\",\"\"))","v":""},{"$f":"IF(DAY(QP18)=1,QP18,IF(QP9=HideValues!$D$3,\"TODAY\",\"\"))","v":""},{"$f":"IF(DAY(QQ18)=1,QQ18,IF(QQ9=HideValues!$D$3,\"TODAY\",\"\"))","v":""},{"$f":"IF(DAY(QR18)=1,QR18,IF(QR9=HideValues!$D$3,\"TODAY\",\"\"))","v":""},{"$f":"IF(DAY(QS18)=1,QS18,IF(QS9=HideValues!$D$3,\"TODAY\",\"\"))","v":""},{"$f":"IF(DAY(QT18)=1,QT18,IF(QT9=HideValues!$D$3,\"TODAY\",\"\"))","v":""},{"$f":"IF(DAY(QU18)=1,QU18,IF(QU9=HideValues!$D$3,\"TODAY\",\"\"))","v":""},{"$f":"IF(DAY(QV18)=1,QV18,IF(QV9=HideValues!$D$3,\"TODAY\",\"\"))","v":""},{"$f":"IF(DAY(QW18)=1,QW18,IF(QW9=HideValues!$D$3,\"TODAY\",\"\"))","v":""},{"$f":"IF(DAY(QX18)=1,QX18,IF(QX9=HideValues!$D$3,\"TODAY\",\"\"))","v":""},{"$f":"IF(DAY(QY18)=1,QY18,IF(QY9=HideValues!$D$3,\"TODAY\",\"\"))","v":""},{"$f":"IF(DAY(QZ18)=1,QZ18,IF(QZ9=HideValues!$D$3,\"TODAY\",\"\"))","v":""},{"$f":"IF(DAY(RA18)=1,RA18,IF(RA9=HideValues!$D$3,\"TODAY\",\"\"))","v":""},{"$f":"IF(DAY(RB18)=1,RB18,IF(RB9=HideValues!$D$3,\"TODAY\",\"\"))","v":""},{"$f":"IF(DAY(RC18)=1,RC18,IF(RC9=HideValues!$D$3,\"TODAY\",\"\"))","v":""},{"$f":"IF(DAY(RD18)=1,RD18,IF(RD9=HideValues!$D$3,\"TODAY\",\"\"))","v":""},{"$f":"IF(DAY(RE18)=1,RE18,IF(RE9=HideValues!$D$3,\"TODAY\",\"\"))","v":""},{"$f":"IF(DAY(RF18)=1,RF18,IF(RF9=HideValues!$D$3,\"TODAY\",\"\"))","v":""},{"$f":"IF(DAY(RG18)=1,RG18,IF(RG9=HideValues!$D$3,\"TODAY\",\"\"))","v":""},{"$f":"IF(DAY(RH18)=1,RH18,IF(RH9=HideValues!$D$3,\"TODAY\",\"\"))","v":""},{"$f":"IF(DAY(RI18)=1,RI18,IF(RI9=HideValues!$D$3,\"TODAY\",\"\"))","v":""},{"$f":"IF(DAY(RJ18)=1,RJ18,IF(RJ9=HideValues!$D$3,\"TODAY\",\"\"))","v":""},{"$f":"IF(DAY(RK18)=1,RK18,IF(RK9=HideValues!$D$3,\"TODAY\",\"\"))","v":""},{"$f":"IF(DAY(RL18)=1,RL18,IF(RL9=HideValues!$D$3,\"TODAY\",\"\"))","v":""},{"$f":"IF(DAY(RM18)=1,RM18,IF(RM9=HideValues!$D$3,\"TODAY\",\"\"))","v":""},{"$f":"IF(DAY(RN18)=1,RN18,IF(RN9=HideValues!$D$3,\"TODAY\",\"\"))","v":""},{"$f":"IF(DAY(RO18)=1,RO18,IF(RO9=HideValues!$D$3,\"TODAY\",\"\"))","v":"2018-02-01"},{"$f":"IF(DAY(RP18)=1,RP18,IF(RP9=HideValues!$D$3,\"TODAY\",\"\"))","v":""},{"$f":"IF(DAY(RQ18)=1,RQ18,IF(RQ9=HideValues!$D$3,\"TODAY\",\"\"))","v":""},{"$f":"IF(DAY(RR18)=1,RR18,IF(RR9=HideValues!$D$3,\"TODAY\",\"\"))","v":""},{"$f":"IF(DAY(RS18)=1,RS18,IF(RS9=HideValues!$D$3,\"TODAY\",\"\"))","v":""},{"$f":"IF(DAY(RT18)=1,RT18,IF(RT9=HideValues!$D$3,\"TODAY\",\"\"))","v":""},{"$f":"IF(DAY(RU18)=1,RU18,IF(RU9=HideValues!$D$3,\"TODAY\",\"\"))","v":""},{"$f":"IF(DAY(RV18)=1,RV18,IF(RV9=HideValues!$D$3,\"TODAY\",\"\"))","v":""},{"$f":"IF(DAY(RW18)=1,RW18,IF(RW9=HideValues!$D$3,\"TODAY\",\"\"))","v":""},{"$f":"IF(DAY(RX18)=1,RX18,IF(RX9=HideValues!$D$3,\"TODAY\",\"\"))","v":""},{"$f":"IF(DAY(RY18)=1,RY18,IF(RY9=HideValues!$D$3,\"TODAY\",\"\"))","v":""},{"$f":"IF(DAY(RZ18)=1,RZ18,IF(RZ9=HideValues!$D$3,\"TODAY\",\"\"))","v":""},{"$f":"IF(DAY(SA18)=1,SA18,IF(SA9=HideValues!$D$3,\"TODAY\",\"\"))","v":""},{"$f":"IF(DAY(SB18)=1,SB18,IF(SB9=HideValues!$D$3,\"TODAY\",\"\"))","v":""},{"$f":"IF(DAY(SC18)=1,SC18,IF(SC9=HideValues!$D$3,\"TODAY\",\"\"))","v":""},{"$f":"IF(DAY(SD18)=1,SD18,IF(SD9=HideValues!$D$3,\"TODAY\",\"\"))","v":""},{"$f":"IF(DAY(SE18)=1,SE18,IF(SE9=HideValues!$D$3,\"TODAY\",\"\"))","v":""},{"$f":"IF(DAY(SF18)=1,SF18,IF(SF9=HideValues!$D$3,\"TODAY\",\"\"))","v":""},{"$f":"IF(DAY(SG18)=1,SG18,IF(SG9=HideValues!$D$3,\"TODAY\",\"\"))","v":""},{"$f":"IF(DAY(SH18)=1,SH18,IF(SH9=HideValues!$D$3,\"TODAY\",\"\"))","v":""},{"$f":"IF(DAY(SI18)=1,SI18,IF(SI9=HideValues!$D$3,\"TODAY\",\"\"))","v":""},{"$f":"IF(DAY(SJ18)=1,SJ18,IF(SJ9=HideValues!$D$3,\"TODAY\",\"\"))","v":""},{"$f":"IF(DAY(SK18)=1,SK18,IF(SK9=HideValues!$D$3,\"TODAY\",\"\"))","v":""},{"$f":"IF(DAY(SL18)=1,SL18,IF(SL9=HideValues!$D$3,\"TODAY\",\"\"))","v":""},{"$f":"IF(DAY(SM18)=1,SM18,IF(SM9=HideValues!$D$3,\"TODAY\",\"\"))","v":""},{"$f":"IF(DAY(SN18)=1,SN18,IF(SN9=HideValues!$D$3,\"TODAY\",\"\"))","v":""},{"$f":"IF(DAY(SO18)=1,SO18,IF(SO9=HideValues!$D$3,\"TODAY\",\"\"))","v":""},{"$f":"IF(DAY(SP18)=1,SP18,IF(SP9=HideValues!$D$3,\"TODAY\",\"\"))","v":""},{"$f":"IF(DAY(SQ18)=1,SQ18,IF(SQ9=HideValues!$D$3,\"TODAY\",\"\"))","v":"2018-03-01"},{"$f":"IF(DAY(SR18)=1,SR18,IF(SR9=HideValues!$D$3,\"TODAY\",\"\"))","v":""},{"$f":"IF(DAY(SS18)=1,SS18,IF(SS9=HideValues!$D$3,\"TODAY\",\"\"))","v":""},{"$f":"IF(DAY(ST18)=1,ST18,IF(ST9=HideValues!$D$3,\"TODAY\",\"\"))","v":""},{"$f":"IF(DAY(SU18)=1,SU18,IF(SU9=HideValues!$D$3,\"TODAY\",\"\"))","v":""},{"$f":"IF(DAY(SV18)=1,SV18,IF(SV9=HideValues!$D$3,\"TODAY\",\"\"))","v":""},{"$f":"IF(DAY(SW18)=1,SW18,IF(SW9=HideValues!$D$3,\"TODAY\",\"\"))","v":""},{"$f":"IF(DAY(SX18)=1,SX18,IF(SX9=HideValues!$D$3,\"TODAY\",\"\"))","v":""},{"$f":"IF(DAY(SY18)=1,SY18,IF(SY9=HideValues!$D$3,\"TODAY\",\"\"))","v":""},{"$f":"IF(DAY(SZ18)=1,SZ18,IF(SZ9=HideValues!$D$3,\"TODAY\",\"\"))","v":""},{"$f":"IF(DAY(TA18)=1,TA18,IF(TA9=HideValues!$D$3,\"TODAY\",\"\"))","v":""},{"$f":"IF(DAY(TB18)=1,TB18,IF(TB9=HideValues!$D$3,\"TODAY\",\"\"))","v":""},{"$f":"IF(DAY(TC18)=1,TC18,IF(TC9=HideValues!$D$3,\"TODAY\",\"\"))","v":""},{"$f":"IF(DAY(TD18)=1,TD18,IF(TD9=HideValues!$D$3,\"TODAY\",\"\"))","v":""},{"$f":"IF(DAY(TE18)=1,TE18,IF(TE9=HideValues!$D$3,\"TODAY\",\"\"))","v":""},{"$f":"IF(DAY(TF18)=1,TF18,IF(TF9=HideValues!$D$3,\"TODAY\",\"\"))","v":""},{"$f":"IF(DAY(TG18)=1,TG18,IF(TG9=HideValues!$D$3,\"TODAY\",\"\"))","v":""},{"$f":"IF(DAY(TH18)=1,TH18,IF(TH9=HideValues!$D$3,\"TODAY\",\"\"))","v":""},{"$f":"IF(DAY(TI18)=1,TI18,IF(TI9=HideValues!$D$3,\"TODAY\",\"\"))","v":""},{"$f":"IF(DAY(TJ18)=1,TJ18,IF(TJ9=HideValues!$D$3,\"TODAY\",\"\"))","v":""},{"$f":"IF(DAY(TK18)=1,TK18,IF(TK9=HideValues!$D$3,\"TODAY\",\"\"))","v":""},{"$f":"IF(DAY(TL18)=1,TL18,IF(TL9=HideValues!$D$3,\"TODAY\",\"\"))","v":""},{"$f":"IF(DAY(TM18)=1,TM18,IF(TM9=HideValues!$D$3,\"TODAY\",\"\"))","v":""},{"$f":"IF(DAY(TN18)=1,TN18,IF(TN9=HideValues!$D$3,\"TODAY\",\"\"))","v":""},{"$f":"IF(DAY(TO18)=1,TO18,IF(TO9=HideValues!$D$3,\"TODAY\",\"\"))","v":""},{"$f":"IF(DAY(TP18)=1,TP18,IF(TP9=HideValues!$D$3,\"TODAY\",\"\"))","v":""},{"$f":"IF(DAY(TQ18)=1,TQ18,IF(TQ9=HideValues!$D$3,\"TODAY\",\"\"))","v":""},{"$f":"IF(DAY(TR18)=1,TR18,IF(TR9=HideValues!$D$3,\"TODAY\",\"\"))","v":""},{"$f":"IF(DAY(TS18)=1,TS18,IF(TS9=HideValues!$D$3,\"TODAY\",\"\"))","v":""},{"$f":"IF(DAY(TT18)=1,TT18,IF(TT9=HideValues!$D$3,\"TODAY\",\"\"))","v":""},{"$f":"IF(DAY(TU18)=1,TU18,IF(TU9=HideValues!$D$3,\"TODAY\",\"\"))","v":""},{"$f":"IF(DAY(TV18)=1,TV18,IF(TV9=HideValues!$D$3,\"TODAY\",\"\"))","v":"2018-04-01"},{"$f":"IF(DAY(TW18)=1,TW18,IF(TW9=HideValues!$D$3,\"TODAY\",\"\"))","v":""},{"$f":"IF(DAY(TX18)=1,TX18,IF(TX9=HideValues!$D$3,\"TODAY\",\"\"))","v":""},{"$f":"IF(DAY(TY18)=1,TY18,IF(TY9=HideValues!$D$3,\"TODAY\",\"\"))","v":""},{"$f":"IF(DAY(TZ18)=1,TZ18,IF(TZ9=HideValues!$D$3,\"TODAY\",\"\"))","v":""},{"$f":"IF(DAY(UA18)=1,UA18,IF(UA9=HideValues!$D$3,\"TODAY\",\"\"))","v":""},{"$f":"IF(DAY(UB18)=1,UB18,IF(UB9=HideValues!$D$3,\"TODAY\",\"\"))","v":""},{"$f":"IF(DAY(UC18)=1,UC18,IF(UC9=HideValues!$D$3,\"TODAY\",\"\"))","v":""},{"$f":"IF(DAY(UD18)=1,UD18,IF(UD9=HideValues!$D$3,\"TODAY\",\"\"))","v":""},{"$f":"IF(DAY(UE18)=1,UE18,IF(UE9=HideValues!$D$3,\"TODAY\",\"\"))","v":""},{"$f":"IF(DAY(UF18)=1,UF18,IF(UF9=HideValues!$D$3,\"TODAY\",\"\"))","v":""},{"$f":"IF(DAY(UG18)=1,UG18,IF(UG9=HideValues!$D$3,\"TODAY\",\"\"))","v":""},{"$f":"IF(DAY(UH18)=1,UH18,IF(UH9=HideValues!$D$3,\"TODAY\",\"\"))","v":""},{"$f":"IF(DAY(UI18)=1,UI18,IF(UI9=HideValues!$D$3,\"TODAY\",\"\"))","v":""},{"$f":"IF(DAY(UJ18)=1,UJ18,IF(UJ9=HideValues!$D$3,\"TODAY\",\"\"))","v":""},{"$f":"IF(DAY(UK18)=1,UK18,IF(UK9=HideValues!$D$3,\"TODAY\",\"\"))","v":""},{"$f":"IF(DAY(UL18)=1,UL18,IF(UL9=HideValues!$D$3,\"TODAY\",\"\"))","v":""},{"$f":"IF(DAY(UM18)=1,UM18,IF(UM9=HideValues!$D$3,\"TODAY\",\"\"))","v":""},{"$f":"IF(DAY(UN18)=1,UN18,IF(UN9=HideValues!$D$3,\"TODAY\",\"\"))","v":""},{"$f":"IF(DAY(UO18)=1,UO18,IF(UO9=HideValues!$D$3,\"TODAY\",\"\"))","v":""},{"$f":"IF(DAY(UP18)=1,UP18,IF(UP9=HideValues!$D$3,\"TODAY\",\"\"))","v":""},{"$f":"IF(DAY(UQ18)=1,UQ18,IF(UQ9=HideValues!$D$3,\"TODAY\",\"\"))","v":""},{"$f":"IF(DAY(UR18)=1,UR18,IF(UR9=HideValues!$D$3,\"TODAY\",\"\"))","v":""},{"$f":"IF(DAY(US18)=1,US18,IF(US9=HideValues!$D$3,\"TODAY\",\"\"))","v":""},{"$f":"IF(DAY(UT18)=1,UT18,IF(UT9=HideValues!$D$3,\"TODAY\",\"\"))","v":""},{"$f":"IF(DAY(UU18)=1,UU18,IF(UU9=HideValues!$D$3,\"TODAY\",\"\"))","v":""},{"$f":"IF(DAY(UV18)=1,UV18,IF(UV9=HideValues!$D$3,\"TODAY\",\"\"))","v":""},{"$f":"IF(DAY(UW18)=1,UW18,IF(UW9=HideValues!$D$3,\"TODAY\",\"\"))","v":""},{"$f":"IF(DAY(UX18)=1,UX18,IF(UX9=HideValues!$D$3,\"TODAY\",\"\"))","v":""},{"$f":"IF(DAY(UY18)=1,UY18,IF(UY9=HideValues!$D$3,\"TODAY\",\"\"))","v":""},{"$f":"IF(DAY(UZ18)=1,UZ18,IF(UZ9=HideValues!$D$3,\"TODAY\",\"\"))","v":"2018-05-01"},{"$f":"IF(DAY(VA18)=1,VA18,IF(VA9=HideValues!$D$3,\"TODAY\",\"\"))","v":""},{"$f":"IF(DAY(VB18)=1,VB18,IF(VB9=HideValues!$D$3,\"TODAY\",\"\"))","v":""},{"$f":"IF(DAY(VC18)=1,VC18,IF(VC9=HideValues!$D$3,\"TODAY\",\"\"))","v":""},{"$f":"IF(DAY(VD18)=1,VD18,IF(VD9=HideValues!$D$3,\"TODAY\",\"\"))","v":""},{"$f":"IF(DAY(VE18)=1,VE18,IF(VE9=HideValues!$D$3,\"TODAY\",\"\"))","v":""},{"$f":"IF(DAY(VF18)=1,VF18,IF(VF9=HideValues!$D$3,\"TODAY\",\"\"))","v":""}]
[]
[]
[]
[null,null,null,null,null,null,null,null,null,null,null,null,null,null,null,null,{"$f":"IF($AD$14=\"%\",Q15,\"\")","v":""},{"$f":"IF($AD$14=\"%\",R15,\"\")","v":""},{"$f":"IF($AD$14=\"%\",S15,\"\")","v":""},null,null,{"$f":"IF($AD$14=\"%\",V15,\"\")","v":""},null,null,{"$f":"IF($AD$14=\"%\",Y15,\"\")","v":""},null,null,{"$f":"IF($AD$14=\"%\",AB15,\"\")","v":""},{"$f":"IF($AD$14=\"%\",AC15,\"\")","v":""},null,null,{"$f":"IF($AD$14=\"%\",AF15,\"\")","v":""},null,null,null,null,null,null,null,null,null,null,null,null,null,null,null,null,null,null,null,null,null,null,null,null,"12-2016",null,null,null,null,null,null,null,null,null,null,null,null,null,null,null,null,null,null,null,null,null,null,null,null,null,null,null,null,null,null,"1-2017",null,null,null,null,null,null,null,null,null,null,null,null,null,null,null,null,null,null,null,null,null,null,null,null,null,null,null,null,null,null,"2-2017",null,null,null,null,null,null,null,null,null,null,null,null,null,null,null,null,null,null,null,null,null,null,null,null,null,null,null,"3-2017",null,null,null,null,null,null,null,null,null,null,null,null,null,null,null,null,null,null,null,null,null,null,null,null,null,null,null,null,null,null,"4-2017",null,null,null,null,null,null,null,null,null,null,null,null,null,null,null,null,null,null,null,null,null,null,null,null,null,null,null,null,null,"5-2017",null,null,null,null,null,null,null,null,null,null,null,null,null,null,null,null,null,null,null,null,null,null,null,null,null,null,null,null,null,null,"6-2017",null,null,null,null,null,null,null,null,null,null,null,null,null,null,null,null,null,null,null,null,null,null,null,null,null,null,null,null,null,"7-2017",null,null,null,null,null,null,null,null,null,null,null,null,null,null,null,null,null,null,null,null,null,null,null,null,null,null,null,null,null,null,"8-2017",null,null,null,null,null,null,null,null,null,null,null,null,null,null,null,null,null,null,null,null,null,null,null,null,null,null,null,null,null,null,"9-2017",null,null,null,null,null,null,null,null,null,null,null,null,null,null,null,null,null,null,null,null,null,null,null,null,null,null,null,null,null,"10-2017",null,null,null,null,null,null,null,null,null,null,null,null,null,null,null,null,null,null,null,null,null,null,null,null,null,null,null,null,null,null,"11-2017",null,null,null,null,null,null,null,null,null,null,null,null,null,null,null,null,null,null,null,null,null,null,null,null,null,null,null,null,null,"12-2017",null,null,null,null,null,null,null,null,null,null,null,null,null,null,null,null,null,null,null,null,null,null,null,null,null,null,null,null,null,null,"1-2018",null,null,null,null,null,null,null,null,null,null,null,null,null,null,null,null,null,null,null,null,null,null,null,null,null,null,null,null,null,null,"2-2018",null,null,null,null,null,null,null,null,null,null,null,null,null,null,null,null,null,null,null,null,null,null,null,null,null,null,null,"3-2018",null,null,null,null,null,null,null,null,null,null,null,null,null,null,null,null,null,null,null,null,null,null,null,null,null,null,null,null,null,null,"4-2018",null,null,null,null,null,null,null,null,null,null,null,null,null,null,null,null,null,null,null,null,null,null,null,null,null,null,null,null,null,"5-2018"]
[null,null,null,null,null,null,null,null,null,null,null,null,null,null,null,null,"Resp.","Début","Durée","Jours ouvrés","Normal","Échéance","Statut","Budget","Statut",null,null,"Estim.","Réel","%",null,"Commentaires",{"$f":"AG16","v":"S46"},null,null,null,null,null,null,{"$f":"AN16","v":"S47"},null,null,null,null,null,null,{"$f":"AU16","v":"S48"},null,null,null,null,null,null,{"$f":"BB16","v":"S49"},null,null,null,null,null,null,{"$f":"BI16","v":"S50"},null,null,null,null,null,null,{"$f":"BP16","v":"S51"},null,null,null,null,null,null,{"$f":"BW16","v":"S52"},null,null,null,null,null,null,{"$f":"CD16","v":"S53"},null,null,null,null,null,null,{"$f":"CK16","v":"S2"},null,null,null,null,null,null,{"$f":"CR16","v":"S3"},null,null,null,null,null,null,{"$f":"CY16","v":"S4"},null,null,null,null,null,null,{"$f":"DF16","v":"S5"},null,null,null,null,null,null,{"$f":"DM16","v":"S6"},null,null,null,null,null,null,{"$f":"DT16","v":"S7"},null,null,null,null,null,null,{"$f":"EA16","v":"S8"},null,null,null,null,null,null,{"$f":"EH16","v":"S9"},null,null,null,null,null,null,{"$f":"EO16","v":"S10"},null,null,null,null,null,null,{"$f":"EV16","v":"S11"},null,null,null,null,null,null,{"$f":"FC16","v":"S12"},null,null,null,null,null,null,{"$f":"FJ16","v":"S13"},null,null,null,null,null,null,{"$f":"FQ16","v":"S14"},null,null,null,null,null,null,{"$f":"FX16","v":"S15"},null,null,null,null,null,null,{"$f":"GE16","v":"S16"},null,null,null,null,null,null,{"$f":"GL16","v":"S17"},null,null,null,null,null,null,{"$f":"GS16","v":"S18"},null,null,null,null,null,null,{"$f":"GZ16","v":"S19"},null,null,null,null,null,null,{"$f":"HG16","v":"S20"},null,null,null,null,null,null,{"$f":"HN16","v":"S21"},null,null,null,null,null,null,{"$f":"HU16","v":"S22"},null,null,null,null,null,null,{"$f":"IB16","v":"S23"},null,null,null,null,null,null,{"$f":"II16","v":"S24"},null,null,null,null,null,null,{"$f":"IP16","v":"S25"},null,null,null,null,null,null,{"$f":"IW16","v":"S26"},null,null,null,null,null,null,{"$f":"JD16","v":"S27"},null,null,null,null,null,null,{"$f":"JK16","v":"S28"},null,null,null,null,null,null,{"$f":"JR16","v":"S29"},null,null,null,null,null,null,{"$f":"JY16","v":"S30"},null,null,null,null,null,null,{"$f":"KF16","v":"S31"},null,null,null,null,null,null,{"$f":"KM16","v":"S32"},null,null,null,null,null,null,{"$f":"KT16","v":"S33"},null,null,null,null,null,null,{"$f":"LA16","v":"S34"},null,null,null,null,null,null,{"$f":"LH16","v":"S35"},null,null,null,null,null,null,{"$f":"LO16","v":"S36"},null,null,null,null,null,null,{"$f":"LV16","v":"S37"},null,null,null,null,null,null,{"$f":"MC16","v":"S38"},null,null,null,null,null,null,{"$f":"MJ16","v":"S39"},null,null,null,null,null,null,{"$f":"MQ16","v":"S40"},null,null,null,null,null,null,{"$f":"MX16","v":"S41"},null,null,null,null,null,null,{"$f":"NE16","v":"S42"},null,null,null,null,null,null,{"$f":"NL16","v":"S43"},null,null,null,null,null,null,{"$f":"NS16","v":"S44"},null,null,null,null,null,null,{"$f":"NZ16","v":"S45"},null,null,null,null,null,null,{"$f":"OG16","v":"S46"},null,null,null,null,null,null,{"$f":"ON16","v":"S47"},null,null,null,null,null,null,{"$f":"OU16","v":"S48"},null,null,null,null,null,null,{"$f":"PB16","v":"S49"},null,null,null,null,null,null,{"$f":"PI16","v":"S50"},null,null,null,null,null,null,{"$f":"PP16","v":"S51"},null,null,null,null,null,null,{"$f":"PW16","v":"S52"},null,null,null,null,null,null,{"$f":"QD16","v":"S53"},null,null,null,null,null,null,{"$f":"QK16","v":"S1"},null,null,null,null,null,null,{"$f":"QR16","v":"S2"},null,null,null,null,null,null,{"$f":"QY16","v":"S3"},null,null,null,null,null,null,{"$f":"RF16","v":"S4"},null,null,null,null,null,null,{"$f":"RM16","v":"S5"},null,null,null,null,null,null,{"$f":"RT16","v":"S6"},null,null,null,null,null,null,{"$f":"SA16","v":"S7"},null,null,null,null,null,null,{"$f":"SH16","v":"S8"},null,null,null,null,null,null,{"$f":"SO16","v":"S9"},null,null,null,null,null,null,{"$f":"SV16","v":"S10"},null,null,null,null,null,null,{"$f":"TC16","v":"S11"},null,null,null,null,null,null,{"$f":"TJ16","v":"S12"},null,null,null,null,null,null,{"$f":"TQ16","v":"S13"},null,null,null,null,null,null,{"$f":"TX16","v":"S14"},null,null,null,null,null,null,{"$f":"UE16","v":"S15"},null,null,null,null,null,null,{"$f":"UL16","v":"S16"},null,null,null,null,null,null,{"$f":"US16","v":"S17"},null,null,null,null,null,null,{"$f":"UZ16","v":"S18"}]
[null,null,null,null,null,null,null,null,null,null,null,null,null,null,null,null,null,null,null,null,null,null,null,null,null,null,null,null,null,null,null,null,{"$f":"HideValues!$B$55&WEEKNUM(AG9,2)","v":"S46"},{"$f":"HideValues!$B$55&WEEKNUM(AH9,2)","v":"S46"},{"$f":"HideValues!$B$55&WEEKNUM(AI9,2)","v":"S46"},{"$f":"HideValues!$B$55&WEEKNUM(AJ9,2)","v":"S46"},{"$f":"HideValues!$B$55&WEEKNUM(AK9,2)","v":"S46"},{"$f":"HideValues!$B$55&WEEKNUM(AL9,2)","v":"S46"},{"$f":"HideValues!$B$55&WEEKNUM(AM9,2)","v":"S47"},{"$f":"HideValues!$B$55&WEEKNUM(AN9,2)","v":"S47"},{"$f":"HideValues!$B$55&WEEKNUM(AO9,2)","v":"S47"},{"$f":"HideValues!$B$55&WEEKNUM(AP9,2)","v":"S47"},{"$f":"HideValues!$B$55&WEEKNUM(AQ9,2)","v":"S47"},{"$f":"HideValues!$B$55&WEEKNUM(AR9,2)","v":"S47"},{"$f":"HideValues!$B$55&WEEKNUM(AS9,2)","v":"S47"},{"$f":"HideValues!$B$55&WEEKNUM(AT9,2)","v":"S48"},{"$f":"HideValues!$B$55&WEEKNUM(AU9,2)","v":"S48"},{"$f":"HideValues!$B$55&WEEKNUM(AV9,2)","v":"S48"},{"$f":"HideValues!$B$55&WEEKNUM(AW9,2)","v":"S48"},{"$f":"HideValues!$B$55&WEEKNUM(AX9,2)","v":"S48"},{"$f":"HideValues!$B$55&WEEKNUM(AY9,2)","v":"S48"},{"$f":"HideValues!$B$55&WEEKNUM(AZ9,2)","v":"S48"},{"$f":"HideValues!$B$55&WEEKNUM(BA9,2)","v":"S49"},{"$f":"HideValues!$B$55&WEEKNUM(BB9,2)","v":"S49"},{"$f":"HideValues!$B$55&WEEKNUM(BC9,2)","v":"S49"},{"$f":"HideValues!$B$55&WEEKNUM(BD9,2)","v":"S49"},{"$f":"HideValues!$B$55&WEEKNUM(BE9,2)","v":"S49"},{"$f":"HideValues!$B$55&WEEKNUM(BF9,2)","v":"S49"},{"$f":"HideValues!$B$55&WEEKNUM(BG9,2)","v":"S49"},{"$f":"HideValues!$B$55&WEEKNUM(BH9,2)","v":"S50"},{"$f":"HideValues!$B$55&WEEKNUM(BI9,2)","v":"S50"},{"$f":"HideValues!$B$55&WEEKNUM(BJ9,2)","v":"S50"},{"$f":"HideValues!$B$55&WEEKNUM(BK9,2)","v":"S50"},{"$f":"HideValues!$B$55&WEEKNUM(BL9,2)","v":"S50"},{"$f":"HideValues!$B$55&WEEKNUM(BM9,2)","v":"S50"},{"$f":"HideValues!$B$55&WEEKNUM(BN9,2)","v":"S50"},{"$f":"HideValues!$B$55&WEEKNUM(BO9,2)","v":"S51"},{"$f":"HideValues!$B$55&WEEKNUM(BP9,2)","v":"S51"},{"$f":"HideValues!$B$55&WEEKNUM(BQ9,2)","v":"S51"},{"$f":"HideValues!$B$55&WEEKNUM(BR9,2)","v":"S51"},{"$f":"HideValues!$B$55&WEEKNUM(BS9,2)","v":"S51"},{"$f":"HideValues!$B$55&WEEKNUM(BT9,2)","v":"S51"},{"$f":"HideValues!$B$55&WEEKNUM(BU9,2)","v":"S51"},{"$f":"HideValues!$B$55&WEEKNUM(BV9,2)","v":"S52"},{"$f":"HideValues!$B$55&WEEKNUM(BW9,2)","v":"S52"},{"$f":"HideValues!$B$55&WEEKNUM(BX9,2)","v":"S52"},{"$f":"HideValues!$B$55&WEEKNUM(BY9,2)","v":"S52"},{"$f":"HideValues!$B$55&WEEKNUM(BZ9,2)","v":"S52"},{"$f":"HideValues!$B$55&WEEKNUM(CA9,2)","v":"S52"},{"$f":"HideValues!$B$55&WEEKNUM(CB9,2)","v":"S52"},{"$f":"HideValues!$B$55&WEEKNUM(CC9,2)","v":"S53"},{"$f":"HideValues!$B$55&WEEKNUM(CD9,2)","v":"S53"},{"$f":"HideValues!$B$55&WEEKNUM(CE9,2)","v":"S53"},{"$f":"HideValues!$B$55&WEEKNUM(CF9,2)","v":"S53"},{"$f":"HideValues!$B$55&WEEKNUM(CG9,2)","v":"S53"},{"$f":"HideValues!$B$55&WEEKNUM(CH9,2)","v":"S53"},{"$f":"HideValues!$B$55&WEEKNUM(CI9,2)","v":"S1"},{"$f":"HideValues!$B$55&WEEKNUM(CJ9,2)","v":"S2"},{"$f":"HideValues!$B$55&WEEKNUM(CK9,2)","v":"S2"},{"$f":"HideValues!$B$55&WEEKNUM(CL9,2)","v":"S2"},{"$f":"HideValues!$B$55&WEEKNUM(CM9,2)","v":"S2"},{"$f":"HideValues!$B$55&WEEKNUM(CN9,2)","v":"S2"},{"$f":"HideValues!$B$55&WEEKNUM(CO9,2)","v":"S2"},{"$f":"HideValues!$B$55&WEEKNUM(CP9,2)","v":"S2"},{"$f":"HideValues!$B$55&WEEKNUM(CQ9,2)","v":"S3"},{"$f":"HideValues!$B$55&WEEKNUM(CR9,2)","v":"S3"},{"$f":"HideValues!$B$55&WEEKNUM(CS9,2)","v":"S3"},{"$f":"HideValues!$B$55&WEEKNUM(CT9,2)","v":"S3"},{"$f":"HideValues!$B$55&WEEKNUM(CU9,2)","v":"S3"},{"$f":"HideValues!$B$55&WEEKNUM(CV9,2)","v":"S3"},{"$f":"HideValues!$B$55&WEEKNUM(CW9,2)","v":"S3"},{"$f":"HideValues!$B$55&WEEKNUM(CX9,2)","v":"S4"},{"$f":"HideValues!$B$55&WEEKNUM(CY9,2)","v":"S4"},{"$f":"HideValues!$B$55&WEEKNUM(CZ9,2)","v":"S4"},{"$f":"HideValues!$B$55&WEEKNUM(DA9,2)","v":"S4"},{"$f":"HideValues!$B$55&WEEKNUM(DB9,2)","v":"S4"},{"$f":"HideValues!$B$55&WEEKNUM(DC9,2)","v":"S4"},{"$f":"HideValues!$B$55&WEEKNUM(DD9,2)","v":"S4"},{"$f":"HideValues!$B$55&WEEKNUM(DE9,2)","v":"S5"},{"$f":"HideValues!$B$55&WEEKNUM(DF9,2)","v":"S5"},{"$f":"HideValues!$B$55&WEEKNUM(DG9,2)","v":"S5"},{"$f":"HideValues!$B$55&WEEKNUM(DH9,2)","v":"S5"},{"$f":"HideValues!$B$55&WEEKNUM(DI9,2)","v":"S5"},{"$f":"HideValues!$B$55&WEEKNUM(DJ9,2)","v":"S5"},{"$f":"HideValues!$B$55&WEEKNUM(DK9,2)","v":"S5"},{"$f":"HideValues!$B$55&WEEKNUM(DL9,2)","v":"S6"},{"$f":"HideValues!$B$55&WEEKNUM(DM9,2)","v":"S6"},{"$f":"HideValues!$B$55&WEEKNUM(DN9,2)","v":"S6"},{"$f":"HideValues!$B$55&WEEKNUM(DO9,2)","v":"S6"},{"$f":"HideValues!$B$55&WEEKNUM(DP9,2)","v":"S6"},{"$f":"HideValues!$B$55&WEEKNUM(DQ9,2)","v":"S6"},{"$f":"HideValues!$B$55&WEEKNUM(DR9,2)","v":"S6"},{"$f":"HideValues!$B$55&WEEKNUM(DS9,2)","v":"S7"},{"$f":"HideValues!$B$55&WEEKNUM(DT9,2)","v":"S7"},{"$f":"HideValues!$B$55&WEEKNUM(DU9,2)","v":"S7"},{"$f":"HideValues!$B$55&WEEKNUM(DV9,2)","v":"S7"},{"$f":"HideValues!$B$55&WEEKNUM(DW9,2)","v":"S7"},{"$f":"HideValues!$B$55&WEEKNUM(DX9,2)","v":"S7"},{"$f":"HideValues!$B$55&WEEKNUM(DY9,2)","v":"S7"},{"$f":"HideValues!$B$55&WEEKNUM(DZ9,2)","v":"S8"},{"$f":"HideValues!$B$55&WEEKNUM(EA9,2)","v":"S8"},{"$f":"HideValues!$B$55&WEEKNUM(EB9,2)","v":"S8"},{"$f":"HideValues!$B$55&WEEKNUM(EC9,2)","v":"S8"},{"$f":"HideValues!$B$55&WEEKNUM(ED9,2)","v":"S8"},{"$f":"HideValues!$B$55&WEEKNUM(EE9,2)","v":"S8"},{"$f":"HideValues!$B$55&WEEKNUM(EF9,2)","v":"S8"},{"$f":"HideValues!$B$55&WEEKNUM(EG9,2)","v":"S9"},{"$f":"HideValues!$B$55&WEEKNUM(EH9,2)","v":"S9"},{"$f":"HideValues!$B$55&WEEKNUM(EI9,2)","v":"S9"},{"$f":"HideValues!$B$55&WEEKNUM(EJ9,2)","v":"S9"},{"$f":"HideValues!$B$55&WEEKNUM(EK9,2)","v":"S9"},{"$f":"HideValues!$B$55&WEEKNUM(EL9,2)","v":"S9"},{"$f":"HideValues!$B$55&WEEKNUM(EM9,2)","v":"S9"},{"$f":"HideValues!$B$55&WEEKNUM(EN9,2)","v":"S10"},{"$f":"HideValues!$B$55&WEEKNUM(EO9,2)","v":"S10"},{"$f":"HideValues!$B$55&WEEKNUM(EP9,2)","v":"S10"},{"$f":"HideValues!$B$55&WEEKNUM(EQ9,2)","v":"S10"},{"$f":"HideValues!$B$55&WEEKNUM(ER9,2)","v":"S10"},{"$f":"HideValues!$B$55&WEEKNUM(ES9,2)","v":"S10"},{"$f":"HideValues!$B$55&WEEKNUM(ET9,2)","v":"S10"},{"$f":"HideValues!$B$55&WEEKNUM(EU9,2)","v":"S11"},{"$f":"HideValues!$B$55&WEEKNUM(EV9,2)","v":"S11"},{"$f":"HideValues!$B$55&WEEKNUM(EW9,2)","v":"S11"},{"$f":"HideValues!$B$55&WEEKNUM(EX9,2)","v":"S11"},{"$f":"HideValues!$B$55&WEEKNUM(EY9,2)","v":"S11"},{"$f":"HideValues!$B$55&WEEKNUM(EZ9,2)","v":"S11"},{"$f":"HideValues!$B$55&WEEKNUM(FA9,2)","v":"S11"},{"$f":"HideValues!$B$55&WEEKNUM(FB9,2)","v":"S12"},{"$f":"HideValues!$B$55&WEEKNUM(FC9,2)","v":"S12"},{"$f":"HideValues!$B$55&WEEKNUM(FD9,2)","v":"S12"},{"$f":"HideValues!$B$55&WEEKNUM(FE9,2)","v":"S12"},{"$f":"HideValues!$B$55&WEEKNUM(FF9,2)","v":"S12"},{"$f":"HideValues!$B$55&WEEKNUM(FG9,2)","v":"S12"},{"$f":"HideValues!$B$55&WEEKNUM(FH9,2)","v":"S12"},{"$f":"HideValues!$B$55&WEEKNUM(FI9,2)","v":"S13"},{"$f":"HideValues!$B$55&WEEKNUM(FJ9,2)","v":"S13"},{"$f":"HideValues!$B$55&WEEKNUM(FK9,2)","v":"S13"},{"$f":"HideValues!$B$55&WEEKNUM(FL9,2)","v":"S13"},{"$f":"HideValues!$B$55&WEEKNUM(FM9,2)","v":"S13"},{"$f":"HideValues!$B$55&WEEKNUM(FN9,2)","v":"S13"},{"$f":"HideValues!$B$55&WEEKNUM(FO9,2)","v":"S13"},{"$f":"HideValues!$B$55&WEEKNUM(FP9,2)","v":"S14"},{"$f":"HideValues!$B$55&WEEKNUM(FQ9,2)","v":"S14"},{"$f":"HideValues!$B$55&WEEKNUM(FR9,2)","v":"S14"},{"$f":"HideValues!$B$55&WEEKNUM(FS9,2)","v":"S14"},{"$f":"HideValues!$B$55&WEEKNUM(FT9,2)","v":"S14"},{"$f":"HideValues!$B$55&WEEKNUM(FU9,2)","v":"S14"},{"$f":"HideValues!$B$55&WEEKNUM(FV9,2)","v":"S14"},{"$f":"HideValues!$B$55&WEEKNUM(FW9,2)","v":"S15"},{"$f":"HideValues!$B$55&WEEKNUM(FX9,2)","v":"S15"},{"$f":"HideValues!$B$55&WEEKNUM(FY9,2)","v":"S15"},{"$f":"HideValues!$B$55&WEEKNUM(FZ9,2)","v":"S15"},{"$f":"HideValues!$B$55&WEEKNUM(GA9,2)","v":"S15"},{"$f":"HideValues!$B$55&WEEKNUM(GB9,2)","v":"S15"},{"$f":"HideValues!$B$55&WEEKNUM(GC9,2)","v":"S15"},{"$f":"HideValues!$B$55&WEEKNUM(GD9,2)","v":"S16"},{"$f":"HideValues!$B$55&WEEKNUM(GE9,2)","v":"S16"},{"$f":"HideValues!$B$55&WEEKNUM(GF9,2)","v":"S16"},{"$f":"HideValues!$B$55&WEEKNUM(GG9,2)","v":"S16"},{"$f":"HideValues!$B$55&WEEKNUM(GH9,2)","v":"S16"},{"$f":"HideValues!$B$55&WEEKNUM(GI9,2)","v":"S16"},{"$f":"HideValues!$B$55&WEEKNUM(GJ9,2)","v":"S16"},{"$f":"HideValues!$B$55&WEEKNUM(GK9,2)","v":"S17"},{"$f":"HideValues!$B$55&WEEKNUM(GL9,2)","v":"S17"},{"$f":"HideValues!$B$55&WEEKNUM(GM9,2)","v":"S17"},{"$f":"HideValues!$B$55&WEEKNUM(GN9,2)","v":"S17"},{"$f":"HideValues!$B$55&WEEKNUM(GO9,2)","v":"S17"},{"$f":"HideValues!$B$55&WEEKNUM(GP9,2)","v":"S17"},{"$f":"HideValues!$B$55&WEEKNUM(GQ9,2)","v":"S17"},{"$f":"HideValues!$B$55&WEEKNUM(GR9,2)","v":"S18"},{"$f":"HideValues!$B$55&WEEKNUM(GS9,2)","v":"S18"},{"$f":"HideValues!$B$55&WEEKNUM(GT9,2)","v":"S18"},{"$f":"HideValues!$B$55&WEEKNUM(GU9,2)","v":"S18"},{"$f":"HideValues!$B$55&WEEKNUM(GV9,2)","v":"S18"},{"$f":"HideValues!$B$55&WEEKNUM(GW9,2)","v":"S18"},{"$f":"HideValues!$B$55&WEEKNUM(GX9,2)","v":"S18"},{"$f":"HideValues!$B$55&WEEKNUM(GY9,2)","v":"S19"},{"$f":"HideValues!$B$55&WEEKNUM(GZ9,2)","v":"S19"},{"$f":"HideValues!$B$55&WEEKNUM(HA9,2)","v":"S19"},{"$f":"HideValues!$B$55&WEEKNUM(HB9,2)","v":"S19"},{"$f":"HideValues!$B$55&WEEKNUM(HC9,2)","v":"S19"},{"$f":"HideValues!$B$55&WEEKNUM(HD9,2)","v":"S19"},{"$f":"HideValues!$B$55&WEEKNUM(HE9,2)","v":"S19"},{"$f":"HideValues!$B$55&WEEKNUM(HF9,2)","v":"S20"},{"$f":"HideValues!$B$55&WEEKNUM(HG9,2)","v":"S20"},{"$f":"HideValues!$B$55&WEEKNUM(HH9,2)","v":"S20"},{"$f":"HideValues!$B$55&WEEKNUM(HI9,2)","v":"S20"},{"$f":"HideValues!$B$55&WEEKNUM(HJ9,2)","v":"S20"},{"$f":"HideValues!$B$55&WEEKNUM(HK9,2)","v":"S20"},{"$f":"HideValues!$B$55&WEEKNUM(HL9,2)","v":"S20"},{"$f":"HideValues!$B$55&WEEKNUM(HM9,2)","v":"S21"},{"$f":"HideValues!$B$55&WEEKNUM(HN9,2)","v":"S21"},{"$f":"HideValues!$B$55&WEEKNUM(HO9,2)","v":"S21"},{"$f":"HideValues!$B$55&WEEKNUM(HP9,2)","v":"S21"},{"$f":"HideValues!$B$55&WEEKNUM(HQ9,2)","v":"S21"},{"$f":"HideValues!$B$55&WEEKNUM(HR9,2)","v":"S21"},{"$f":"HideValues!$B$55&WEEKNUM(HS9,2)","v":"S21"},{"$f":"HideValues!$B$55&WEEKNUM(HT9,2)","v":"S22"},{"$f":"HideValues!$B$55&WEEKNUM(HU9,2)","v":"S22"},{"$f":"HideValues!$B$55&WEEKNUM(HV9,2)","v":"S22"},{"$f":"HideValues!$B$55&WEEKNUM(HW9,2)","v":"S22"},{"$f":"HideValues!$B$55&WEEKNUM(HX9,2)","v":"S22"},{"$f":"HideValues!$B$55&WEEKNUM(HY9,2)","v":"S22"},{"$f":"HideValues!$B$55&WEEKNUM(HZ9,2)","v":"S22"},{"$f":"HideValues!$B$55&WEEKNUM(IA9,2)","v":"S23"},{"$f":"HideValues!$B$55&WEEKNUM(IB9,2)","v":"S23"},{"$f":"HideValues!$B$55&WEEKNUM(IC9,2)","v":"S23"},{"$f":"HideValues!$B$55&WEEKNUM(ID9,2)","v":"S23"},{"$f":"HideValues!$B$55&WEEKNUM(IE9,2)","v":"S23"},{"$f":"HideValues!$B$55&WEEKNUM(IF9,2)","v":"S23"},{"$f":"HideValues!$B$55&WEEKNUM(IG9,2)","v":"S23"},{"$f":"HideValues!$B$55&WEEKNUM(IH9,2)","v":"S24"},{"$f":"HideValues!$B$55&WEEKNUM(II9,2)","v":"S24"},{"$f":"HideValues!$B$55&WEEKNUM(IJ9,2)","v":"S24"},{"$f":"HideValues!$B$55&WEEKNUM(IK9,2)","v":"S24"},{"$f":"HideValues!$B$55&WEEKNUM(IL9,2)","v":"S24"},{"$f":"HideValues!$B$55&WEEKNUM(IM9,2)","v":"S24"},{"$f":"HideValues!$B$55&WEEKNUM(IN9,2)","v":"S24"},{"$f":"HideValues!$B$55&WEEKNUM(IO9,2)","v":"S25"},{"$f":"HideValues!$B$55&WEEKNUM(IP9,2)","v":"S25"},{"$f":"HideValues!$B$55&WEEKNUM(IQ9,2)","v":"S25"},{"$f":"HideValues!$B$55&WEEKNUM(IR9,2)","v":"S25"},{"$f":"HideValues!$B$55&WEEKNUM(IS9,2)","v":"S25"},{"$f":"HideValues!$B$55&WEEKNUM(IT9,2)","v":"S25"},{"$f":"HideValues!$B$55&WEEKNUM(IU9,2)","v":"S25"},{"$f":"HideValues!$B$55&WEEKNUM(IV9,2)","v":"S26"},{"$f":"HideValues!$B$55&WEEKNUM(IW9,2)","v":"S26"},{"$f":"HideValues!$B$55&WEEKNUM(IX9,2)","v":"S26"},{"$f":"HideValues!$B$55&WEEKNUM(IY9,2)","v":"S26"},{"$f":"HideValues!$B$55&WEEKNUM(IZ9,2)","v":"S26"},{"$f":"HideValues!$B$55&WEEKNUM(JA9,2)","v":"S26"},{"$f":"HideValues!$B$55&WEEKNUM(JB9,2)","v":"S26"},{"$f":"HideValues!$B$55&WEEKNUM(JC9,2)","v":"S27"},{"$f":"HideValues!$B$55&WEEKNUM(JD9,2)","v":"S27"},{"$f":"HideValues!$B$55&WEEKNUM(JE9,2)","v":"S27"},{"$f":"HideValues!$B$55&WEEKNUM(JF9,2)","v":"S27"},{"$f":"HideValues!$B$55&WEEKNUM(JG9,2)","v":"S27"},{"$f":"HideValues!$B$55&WEEKNUM(JH9,2)","v":"S27"},{"$f":"HideValues!$B$55&WEEKNUM(JI9,2)","v":"S27"},{"$f":"HideValues!$B$55&WEEKNUM(JJ9,2)","v":"S28"},{"$f":"HideValues!$B$55&WEEKNUM(JK9,2)","v":"S28"},{"$f":"HideValues!$B$55&WEEKNUM(JL9,2)","v":"S28"},{"$f":"HideValues!$B$55&WEEKNUM(JM9,2)","v":"S28"},{"$f":"HideValues!$B$55&WEEKNUM(JN9,2)","v":"S28"},{"$f":"HideValues!$B$55&WEEKNUM(JO9,2)","v":"S28"},{"$f":"HideValues!$B$55&WEEKNUM(JP9,2)","v":"S28"},{"$f":"HideValues!$B$55&WEEKNUM(JQ9,2)","v":"S29"},{"$f":"HideValues!$B$55&WEEKNUM(JR9,2)","v":"S29"},{"$f":"HideValues!$B$55&WEEKNUM(JS9,2)","v":"S29"},{"$f":"HideValues!$B$55&WEEKNUM(JT9,2)","v":"S29"},{"$f":"HideValues!$B$55&WEEKNUM(JU9,2)","v":"S29"},{"$f":"HideValues!$B$55&WEEKNUM(JV9,2)","v":"S29"},{"$f":"HideValues!$B$55&WEEKNUM(JW9,2)","v":"S29"},{"$f":"HideValues!$B$55&WEEKNUM(JX9,2)","v":"S30"},{"$f":"HideValues!$B$55&WEEKNUM(JY9,2)","v":"S30"},{"$f":"HideValues!$B$55&WEEKNUM(JZ9,2)","v":"S30"},{"$f":"HideValues!$B$55&WEEKNUM(KA9,2)","v":"S30"},{"$f":"HideValues!$B$55&WEEKNUM(KB9,2)","v":"S30"},{"$f":"HideValues!$B$55&WEEKNUM(KC9,2)","v":"S30"},{"$f":"HideValues!$B$55&WEEKNUM(KD9,2)","v":"S30"},{"$f":"HideValues!$B$55&WEEKNUM(KE9,2)","v":"S31"},{"$f":"HideValues!$B$55&WEEKNUM(KF9,2)","v":"S31"},{"$f":"HideValues!$B$55&WEEKNUM(KG9,2)","v":"S31"},{"$f":"HideValues!$B$55&WEEKNUM(KH9,2)","v":"S31"},{"$f":"HideValues!$B$55&WEEKNUM(KI9,2)","v":"S31"},{"$f":"HideValues!$B$55&WEEKNUM(KJ9,2)","v":"S31"},{"$f":"HideValues!$B$55&WEEKNUM(KK9,2)","v":"S31"},{"$f":"HideValues!$B$55&WEEKNUM(KL9,2)","v":"S32"},{"$f":"HideValues!$B$55&WEEKNUM(KM9,2)","v":"S32"},{"$f":"HideValues!$B$55&WEEKNUM(KN9,2)","v":"S32"},{"$f":"HideValues!$B$55&WEEKNUM(KO9,2)","v":"S32"},{"$f":"HideValues!$B$55&WEEKNUM(KP9,2)","v":"S32"},{"$f":"HideValues!$B$55&WEEKNUM(KQ9,2)","v":"S32"},{"$f":"HideValues!$B$55&WEEKNUM(KR9,2)","v":"S32"},{"$f":"HideValues!$B$55&WEEKNUM(KS9,2)","v":"S33"},{"$f":"HideValues!$B$55&WEEKNUM(KT9,2)","v":"S33"},{"$f":"HideValues!$B$55&WEEKNUM(KU9,2)","v":"S33"},{"$f":"HideValues!$B$55&WEEKNUM(KV9,2)","v":"S33"},{"$f":"HideValues!$B$55&WEEKNUM(KW9,2)","v":"S33"},{"$f":"HideValues!$B$55&WEEKNUM(KX9,2)","v":"S33"},{"$f":"HideValues!$B$55&WEEKNUM(KY9,2)","v":"S33"},{"$f":"HideValues!$B$55&WEEKNUM(KZ9,2)","v":"S34"},{"$f":"HideValues!$B$55&WEEKNUM(LA9,2)","v":"S34"},{"$f":"HideValues!$B$55&WEEKNUM(LB9,2)","v":"S34"},{"$f":"HideValues!$B$55&WEEKNUM(LC9,2)","v":"S34"},{"$f":"HideValues!$B$55&WEEKNUM(LD9,2)","v":"S34"},{"$f":"HideValues!$B$55&WEEKNUM(LE9,2)","v":"S34"},{"$f":"HideValues!$B$55&WEEKNUM(LF9,2)","v":"S34"},{"$f":"HideValues!$B$55&WEEKNUM(LG9,2)","v":"S35"},{"$f":"HideValues!$B$55&WEEKNUM(LH9,2)","v":"S35"},{"$f":"HideValues!$B$55&WEEKNUM(LI9,2)","v":"S35"},{"$f":"HideValues!$B$55&WEEKNUM(LJ9,2)","v":"S35"},{"$f":"HideValues!$B$55&WEEKNUM(LK9,2)","v":"S35"},{"$f":"HideValues!$B$55&WEEKNUM(LL9,2)","v":"S35"},{"$f":"HideValues!$B$55&WEEKNUM(LM9,2)","v":"S35"},{"$f":"HideValues!$B$55&WEEKNUM(LN9,2)","v":"S36"},{"$f":"HideValues!$B$55&WEEKNUM(LO9,2)","v":"S36"},{"$f":"HideValues!$B$55&WEEKNUM(LP9,2)","v":"S36"},{"$f":"HideValues!$B$55&WEEKNUM(LQ9,2)","v":"S36"},{"$f":"HideValues!$B$55&WEEKNUM(LR9,2)","v":"S36"},{"$f":"HideValues!$B$55&WEEKNUM(LS9,2)","v":"S36"},{"$f":"HideValues!$B$55&WEEKNUM(LT9,2)","v":"S36"},{"$f":"HideValues!$B$55&WEEKNUM(LU9,2)","v":"S37"},{"$f":"HideValues!$B$55&WEEKNUM(LV9,2)","v":"S37"},{"$f":"HideValues!$B$55&WEEKNUM(LW9,2)","v":"S37"},{"$f":"HideValues!$B$55&WEEKNUM(LX9,2)","v":"S37"},{"$f":"HideValues!$B$55&WEEKNUM(LY9,2)","v":"S37"},{"$f":"HideValues!$B$55&WEEKNUM(LZ9,2)","v":"S37"},{"$f":"HideValues!$B$55&WEEKNUM(MA9,2)","v":"S37"},{"$f":"HideValues!$B$55&WEEKNUM(MB9,2)","v":"S38"},{"$f":"HideValues!$B$55&WEEKNUM(MC9,2)","v":"S38"},{"$f":"HideValues!$B$55&WEEKNUM(MD9,2)","v":"S38"},{"$f":"HideValues!$B$55&WEEKNUM(ME9,2)","v":"S38"},{"$f":"HideValues!$B$55&WEEKNUM(MF9,2)","v":"S38"},{"$f":"HideValues!$B$55&WEEKNUM(MG9,2)","v":"S38"},{"$f":"HideValues!$B$55&WEEKNUM(MH9,2)","v":"S38"},{"$f":"HideValues!$B$55&WEEKNUM(MI9,2)","v":"S39"},{"$f":"HideValues!$B$55&WEEKNUM(MJ9,2)","v":"S39"},{"$f":"HideValues!$B$55&WEEKNUM(MK9,2)","v":"S39"},{"$f":"HideValues!$B$55&WEEKNUM(ML9,2)","v":"S39"},{"$f":"HideValues!$B$55&WEEKNUM(MM9,2)","v":"S39"},{"$f":"HideValues!$B$55&WEEKNUM(MN9,2)","v":"S39"},{"$f":"HideValues!$B$55&WEEKNUM(MO9,2)","v":"S39"},{"$f":"HideValues!$B$55&WEEKNUM(MP9,2)","v":"S40"},{"$f":"HideValues!$B$55&WEEKNUM(MQ9,2)","v":"S40"},{"$f":"HideValues!$B$55&WEEKNUM(MR9,2)","v":"S40"},{"$f":"HideValues!$B$55&WEEKNUM(MS9,2)","v":"S40"},{"$f":"HideValues!$B$55&WEEKNUM(MT9,2)","v":"S40"},{"$f":"HideValues!$B$55&WEEKNUM(MU9,2)","v":"S40"},{"$f":"HideValues!$B$55&WEEKNUM(MV9,2)","v":"S40"},{"$f":"HideValues!$B$55&WEEKNUM(MW9,2)","v":"S41"},{"$f":"HideValues!$B$55&WEEKNUM(MX9,2)","v":"S41"},{"$f":"HideValues!$B$55&WEEKNUM(MY9,2)","v":"S41"},{"$f":"HideValues!$B$55&WEEKNUM(MZ9,2)","v":"S41"},{"$f":"HideValues!$B$55&WEEKNUM(NA9,2)","v":"S41"},{"$f":"HideValues!$B$55&WEEKNUM(NB9,2)","v":"S41"},{"$f":"HideValues!$B$55&WEEKNUM(NC9,2)","v":"S41"},{"$f":"HideValues!$B$55&WEEKNUM(ND9,2)","v":"S42"},{"$f":"HideValues!$B$55&WEEKNUM(NE9,2)","v":"S42"},{"$f":"HideValues!$B$55&WEEKNUM(NF9,2)","v":"S42"},{"$f":"HideValues!$B$55&WEEKNUM(NG9,2)","v":"S42"},{"$f":"HideValues!$B$55&WEEKNUM(NH9,2)","v":"S42"},{"$f":"HideValues!$B$55&WEEKNUM(NI9,2)","v":"S42"},{"$f":"HideValues!$B$55&WEEKNUM(NJ9,2)","v":"S42"},{"$f":"HideValues!$B$55&WEEKNUM(NK9,2)","v":"S43"},{"$f":"HideValues!$B$55&WEEKNUM(NL9,2)","v":"S43"},{"$f":"HideValues!$B$55&WEEKNUM(NM9,2)","v":"S43"},{"$f":"HideValues!$B$55&WEEKNUM(NN9,2)","v":"S43"},{"$f":"HideValues!$B$55&WEEKNUM(NO9,2)","v":"S43"},{"$f":"HideValues!$B$55&WEEKNUM(NP9,2)","v":"S43"},{"$f":"HideValues!$B$55&WEEKNUM(NQ9,2)","v":"S43"},{"$f":"HideValues!$B$55&WEEKNUM(NR9,2)","v":"S44"},{"$f":"HideValues!$B$55&WEEKNUM(NS9,2)","v":"S44"},{"$f":"HideValues!$B$55&WEEKNUM(NT9,2)","v":"S44"},{"$f":"HideValues!$B$55&WEEKNUM(NU9,2)","v":"S44"},{"$f":"HideValues!$B$55&WEEKNUM(NV9,2)","v":"S44"},{"$f":"HideValues!$B$55&WEEKNUM(NW9,2)","v":"S44"},{"$f":"HideValues!$B$55&WEEKNUM(NX9,2)","v":"S44"},{"$f":"HideValues!$B$55&WEEKNUM(NY9,2)","v":"S45"},{"$f":"HideValues!$B$55&WEEKNUM(NZ9,2)","v":"S45"},{"$f":"HideValues!$B$55&WEEKNUM(OA9,2)","v":"S45"},{"$f":"HideValues!$B$55&WEEKNUM(OB9,2)","v":"S45"},{"$f":"HideValues!$B$55&WEEKNUM(OC9,2)","v":"S45"},{"$f":"HideValues!$B$55&WEEKNUM(OD9,2)","v":"S45"},{"$f":"HideValues!$B$55&WEEKNUM(OE9,2)","v":"S45"},{"$f":"HideValues!$B$55&WEEKNUM(OF9,2)","v":"S46"},{"$f":"HideValues!$B$55&WEEKNUM(OG9,2)","v":"S46"},{"$f":"HideValues!$B$55&WEEKNUM(OH9,2)","v":"S46"},{"$f":"HideValues!$B$55&WEEKNUM(OI9,2)","v":"S46"},{"$f":"HideValues!$B$55&WEEKNUM(OJ9,2)","v":"S46"},{"$f":"HideValues!$B$55&WEEKNUM(OK9,2)","v":"S46"},{"$f":"HideValues!$B$55&WEEKNUM(OL9,2)","v":"S46"},{"$f":"HideValues!$B$55&WEEKNUM(OM9,2)","v":"S47"},{"$f":"HideValues!$B$55&WEEKNUM(ON9,2)","v":"S47"},{"$f":"HideValues!$B$55&WEEKNUM(OO9,2)","v":"S47"},{"$f":"HideValues!$B$55&WEEKNUM(OP9,2)","v":"S47"},{"$f":"HideValues!$B$55&WEEKNUM(OQ9,2)","v":"S47"},{"$f":"HideValues!$B$55&WEEKNUM(OR9,2)","v":"S47"},{"$f":"HideValues!$B$55&WEEKNUM(OS9,2)","v":"S47"},{"$f":"HideValues!$B$55&WEEKNUM(OT9,2)","v":"S48"},{"$f":"HideValues!$B$55&WEEKNUM(OU9,2)","v":"S48"},{"$f":"HideValues!$B$55&WEEKNUM(OV9,2)","v":"S48"},{"$f":"HideValues!$B$55&WEEKNUM(OW9,2)","v":"S48"},{"$f":"HideValues!$B$55&WEEKNUM(OX9,2)","v":"S48"},{"$f":"HideValues!$B$55&WEEKNUM(OY9,2)","v":"S48"},{"$f":"HideValues!$B$55&WEEKNUM(OZ9,2)","v":"S48"},{"$f":"HideValues!$B$55&WEEKNUM(PA9,2)","v":"S49"},{"$f":"HideValues!$B$55&WEEKNUM(PB9,2)","v":"S49"},{"$f":"HideValues!$B$55&WEEKNUM(PC9,2)","v":"S49"},{"$f":"HideValues!$B$55&WEEKNUM(PD9,2)","v":"S49"},{"$f":"HideValues!$B$55&WEEKNUM(PE9,2)","v":"S49"},{"$f":"HideValues!$B$55&WEEKNUM(PF9,2)","v":"S49"},{"$f":"HideValues!$B$55&WEEKNUM(PG9,2)","v":"S49"},{"$f":"HideValues!$B$55&WEEKNUM(PH9,2)","v":"S50"},{"$f":"HideValues!$B$55&WEEKNUM(PI9,2)","v":"S50"},{"$f":"HideValues!$B$55&WEEKNUM(PJ9,2)","v":"S50"},{"$f":"HideValues!$B$55&WEEKNUM(PK9,2)","v":"S50"},{"$f":"HideValues!$B$55&WEEKNUM(PL9,2)","v":"S50"},{"$f":"HideValues!$B$55&WEEKNUM(PM9,2)","v":"S50"},{"$f":"HideValues!$B$55&WEEKNUM(PN9,2)","v":"S50"},{"$f":"HideValues!$B$55&WEEKNUM(PO9,2)","v":"S51"},{"$f":"HideValues!$B$55&WEEKNUM(PP9,2)","v":"S51"},{"$f":"HideValues!$B$55&WEEKNUM(PQ9,2)","v":"S51"},{"$f":"HideValues!$B$55&WEEKNUM(PR9,2)","v":"S51"},{"$f":"HideValues!$B$55&WEEKNUM(PS9,2)","v":"S51"},{"$f":"HideValues!$B$55&WEEKNUM(PT9,2)","v":"S51"},{"$f":"HideValues!$B$55&WEEKNUM(PU9,2)","v":"S51"},{"$f":"HideValues!$B$55&WEEKNUM(PV9,2)","v":"S52"},{"$f":"HideValues!$B$55&WEEKNUM(PW9,2)","v":"S52"},{"$f":"HideValues!$B$55&WEEKNUM(PX9,2)","v":"S52"},{"$f":"HideValues!$B$55&WEEKNUM(PY9,2)","v":"S52"},{"$f":"HideValues!$B$55&WEEKNUM(PZ9,2)","v":"S52"},{"$f":"HideValues!$B$55&WEEKNUM(QA9,2)","v":"S52"},{"$f":"HideValues!$B$55&WEEKNUM(QB9,2)","v":"S52"},{"$f":"HideValues!$B$55&WEEKNUM(QC9,2)","v":"S53"},{"$f":"HideValues!$B$55&WEEKNUM(QD9,2)","v":"S53"},{"$f":"HideValues!$B$55&WEEKNUM(QE9,2)","v":"S53"},{"$f":"HideValues!$B$55&WEEKNUM(QF9,2)","v":"S53"},{"$f":"HideValues!$B$55&WEEKNUM(QG9,2)","v":"S53"},{"$f":"HideValues!$B$55&WEEKNUM(QH9,2)","v":"S53"},{"$f":"HideValues!$B$55&WEEKNUM(QI9,2)","v":"S53"},{"$f":"HideValues!$B$55&WEEKNUM(QJ9,2)","v":"S1"},{"$f":"HideValues!$B$55&WEEKNUM(QK9,2)","v":"S1"},{"$f":"HideValues!$B$55&WEEKNUM(QL9,2)","v":"S1"},{"$f":"HideValues!$B$55&WEEKNUM(QM9,2)","v":"S1"},{"$f":"HideValues!$B$55&WEEKNUM(QN9,2)","v":"S1"},{"$f":"HideValues!$B$55&WEEKNUM(QO9,2)","v":"S1"},{"$f":"HideValues!$B$55&WEEKNUM(QP9,2)","v":"S1"},{"$f":"HideValues!$B$55&WEEKNUM(QQ9,2)","v":"S2"},{"$f":"HideValues!$B$55&WEEKNUM(QR9,2)","v":"S2"},{"$f":"HideValues!$B$55&WEEKNUM(QS9,2)","v":"S2"},{"$f":"HideValues!$B$55&WEEKNUM(QT9,2)","v":"S2"},{"$f":"HideValues!$B$55&WEEKNUM(QU9,2)","v":"S2"},{"$f":"HideValues!$B$55&WEEKNUM(QV9,2)","v":"S2"},{"$f":"HideValues!$B$55&WEEKNUM(QW9,2)","v":"S2"},{"$f":"HideValues!$B$55&WEEKNUM(QX9,2)","v":"S3"},{"$f":"HideValues!$B$55&WEEKNUM(QY9,2)","v":"S3"},{"$f":"HideValues!$B$55&WEEKNUM(QZ9,2)","v":"S3"},{"$f":"HideValues!$B$55&WEEKNUM(RA9,2)","v":"S3"},{"$f":"HideValues!$B$55&WEEKNUM(RB9,2)","v":"S3"},{"$f":"HideValues!$B$55&WEEKNUM(RC9,2)","v":"S3"},{"$f":"HideValues!$B$55&WEEKNUM(RD9,2)","v":"S3"},{"$f":"HideValues!$B$55&WEEKNUM(RE9,2)","v":"S4"},{"$f":"HideValues!$B$55&WEEKNUM(RF9,2)","v":"S4"},{"$f":"HideValues!$B$55&WEEKNUM(RG9,2)","v":"S4"},{"$f":"HideValues!$B$55&WEEKNUM(RH9,2)","v":"S4"},{"$f":"HideValues!$B$55&WEEKNUM(RI9,2)","v":"S4"},{"$f":"HideValues!$B$55&WEEKNUM(RJ9,2)","v":"S4"},{"$f":"HideValues!$B$55&WEEKNUM(RK9,2)","v":"S4"},{"$f":"HideValues!$B$55&WEEKNUM(RL9,2)","v":"S5"},{"$f":"HideValues!$B$55&WEEKNUM(RM9,2)","v":"S5"},{"$f":"HideValues!$B$55&WEEKNUM(RN9,2)","v":"S5"},{"$f":"HideValues!$B$55&WEEKNUM(RO9,2)","v":"S5"},{"$f":"HideValues!$B$55&WEEKNUM(RP9,2)","v":"S5"},{"$f":"HideValues!$B$55&WEEKNUM(RQ9,2)","v":"S5"},{"$f":"HideValues!$B$55&WEEKNUM(RR9,2)","v":"S5"},{"$f":"HideValues!$B$55&WEEKNUM(RS9,2)","v":"S6"},{"$f":"HideValues!$B$55&WEEKNUM(RT9,2)","v":"S6"},{"$f":"HideValues!$B$55&WEEKNUM(RU9,2)","v":"S6"},{"$f":"HideValues!$B$55&WEEKNUM(RV9,2)","v":"S6"},{"$f":"HideValues!$B$55&WEEKNUM(RW9,2)","v":"S6"},{"$f":"HideValues!$B$55&WEEKNUM(RX9,2)","v":"S6"},{"$f":"HideValues!$B$55&WEEKNUM(RY9,2)","v":"S6"},{"$f":"HideValues!$B$55&WEEKNUM(RZ9,2)","v":"S7"},{"$f":"HideValues!$B$55&WEEKNUM(SA9,2)","v":"S7"},{"$f":"HideValues!$B$55&WEEKNUM(SB9,2)","v":"S7"},{"$f":"HideValues!$B$55&WEEKNUM(SC9,2)","v":"S7"},{"$f":"HideValues!$B$55&WEEKNUM(SD9,2)","v":"S7"},{"$f":"HideValues!$B$55&WEEKNUM(SE9,2)","v":"S7"},{"$f":"HideValues!$B$55&WEEKNUM(SF9,2)","v":"S7"},{"$f":"HideValues!$B$55&WEEKNUM(SG9,2)","v":"S8"},{"$f":"HideValues!$B$55&WEEKNUM(SH9,2)","v":"S8"},{"$f":"HideValues!$B$55&WEEKNUM(SI9,2)","v":"S8"},{"$f":"HideValues!$B$55&WEEKNUM(SJ9,2)","v":"S8"},{"$f":"HideValues!$B$55&WEEKNUM(SK9,2)","v":"S8"},{"$f":"HideValues!$B$55&WEEKNUM(SL9,2)","v":"S8"},{"$f":"HideValues!$B$55&WEEKNUM(SM9,2)","v":"S8"},{"$f":"HideValues!$B$55&WEEKNUM(SN9,2)","v":"S9"},{"$f":"HideValues!$B$55&WEEKNUM(SO9,2)","v":"S9"},{"$f":"HideValues!$B$55&WEEKNUM(SP9,2)","v":"S9"},{"$f":"HideValues!$B$55&WEEKNUM(SQ9,2)","v":"S9"},{"$f":"HideValues!$B$55&WEEKNUM(SR9,2)","v":"S9"},{"$f":"HideValues!$B$55&WEEKNUM(SS9,2)","v":"S9"},{"$f":"HideValues!$B$55&WEEKNUM(ST9,2)","v":"S9"},{"$f":"HideValues!$B$55&WEEKNUM(SU9,2)","v":"S10"},{"$f":"HideValues!$B$55&WEEKNUM(SV9,2)","v":"S10"},{"$f":"HideValues!$B$55&WEEKNUM(SW9,2)","v":"S10"},{"$f":"HideValues!$B$55&WEEKNUM(SX9,2)","v":"S10"},{"$f":"HideValues!$B$55&WEEKNUM(SY9,2)","v":"S10"},{"$f":"HideValues!$B$55&WEEKNUM(SZ9,2)","v":"S10"},{"$f":"HideValues!$B$55&WEEKNUM(TA9,2)","v":"S10"},{"$f":"HideValues!$B$55&WEEKNUM(TB9,2)","v":"S11"},{"$f":"HideValues!$B$55&WEEKNUM(TC9,2)","v":"S11"},{"$f":"HideValues!$B$55&WEEKNUM(TD9,2)","v":"S11"},{"$f":"HideValues!$B$55&WEEKNUM(TE9,2)","v":"S11"},{"$f":"HideValues!$B$55&WEEKNUM(TF9,2)","v":"S11"},{"$f":"HideValues!$B$55&WEEKNUM(TG9,2)","v":"S11"},{"$f":"HideValues!$B$55&WEEKNUM(TH9,2)","v":"S11"},{"$f":"HideValues!$B$55&WEEKNUM(TI9,2)","v":"S12"},{"$f":"HideValues!$B$55&WEEKNUM(TJ9,2)","v":"S12"},{"$f":"HideValues!$B$55&WEEKNUM(TK9,2)","v":"S12"},{"$f":"HideValues!$B$55&WEEKNUM(TL9,2)","v":"S12"},{"$f":"HideValues!$B$55&WEEKNUM(TM9,2)","v":"S12"},{"$f":"HideValues!$B$55&WEEKNUM(TN9,2)","v":"S12"},{"$f":"HideValues!$B$55&WEEKNUM(TO9,2)","v":"S12"},{"$f":"HideValues!$B$55&WEEKNUM(TP9,2)","v":"S13"},{"$f":"HideValues!$B$55&WEEKNUM(TQ9,2)","v":"S13"},{"$f":"HideValues!$B$55&WEEKNUM(TR9,2)","v":"S13"},{"$f":"HideValues!$B$55&WEEKNUM(TS9,2)","v":"S13"},{"$f":"HideValues!$B$55&WEEKNUM(TT9,2)","v":"S13"},{"$f":"HideValues!$B$55&WEEKNUM(TU9,2)","v":"S13"},{"$f":"HideValues!$B$55&WEEKNUM(TV9,2)","v":"S13"},{"$f":"HideValues!$B$55&WEEKNUM(TW9,2)","v":"S14"},{"$f":"HideValues!$B$55&WEEKNUM(TX9,2)","v":"S14"},{"$f":"HideValues!$B$55&WEEKNUM(TY9,2)","v":"S14"},{"$f":"HideValues!$B$55&WEEKNUM(TZ9,2)","v":"S14"},{"$f":"HideValues!$B$55&WEEKNUM(UA9,2)","v":"S14"},{"$f":"HideValues!$B$55&WEEKNUM(UB9,2)","v":"S14"},{"$f":"HideValues!$B$55&WEEKNUM(UC9,2)","v":"S14"},{"$f":"HideValues!$B$55&WEEKNUM(UD9,2)","v":"S15"},{"$f":"HideValues!$B$55&WEEKNUM(UE9,2)","v":"S15"},{"$f":"HideValues!$B$55&WEEKNUM(UF9,2)","v":"S15"},{"$f":"HideValues!$B$55&WEEKNUM(UG9,2)","v":"S15"},{"$f":"HideValues!$B$55&WEEKNUM(UH9,2)","v":"S15"},{"$f":"HideValues!$B$55&WEEKNUM(UI9,2)","v":"S15"},{"$f":"HideValues!$B$55&WEEKNUM(UJ9,2)","v":"S15"},{"$f":"HideValues!$B$55&WEEKNUM(UK9,2)","v":"S16"},{"$f":"HideValues!$B$55&WEEKNUM(UL9,2)","v":"S16"},{"$f":"HideValues!$B$55&WEEKNUM(UM9,2)","v":"S16"},{"$f":"HideValues!$B$55&WEEKNUM(UN9,2)","v":"S16"},{"$f":"HideValues!$B$55&WEEKNUM(UO9,2)","v":"S16"},{"$f":"HideValues!$B$55&WEEKNUM(UP9,2)","v":"S16"},{"$f":"HideValues!$B$55&WEEKNUM(UQ9,2)","v":"S16"},{"$f":"HideValues!$B$55&WEEKNUM(UR9,2)","v":"S17"},{"$f":"HideValues!$B$55&WEEKNUM(US9,2)","v":"S17"},{"$f":"HideValues!$B$55&WEEKNUM(UT9,2)","v":"S17"},{"$f":"HideValues!$B$55&WEEKNUM(UU9,2)","v":"S17"},{"$f":"HideValues!$B$55&WEEKNUM(UV9,2)","v":"S17"},{"$f":"HideValues!$B$55&WEEKNUM(UW9,2)","v":"S17"},{"$f":"HideValues!$B$55&WEEKNUM(UX9,2)","v":"S17"},{"$f":"HideValues!$B$55&WEEKNUM(UY9,2)","v":"S18"},{"$f":"HideValues!$B$55&WEEKNUM(UZ9,2)","v":"S18"},{"$f":"HideValues!$B$55&WEEKNUM(VA9,2)","v":"S18"},{"$f":"HideValues!$B$55&WEEKNUM(VB9,2)","v":"S18"},{"$f":"HideValues!$B$55&WEEKNUM(VC9,2)","v":"S18"},{"$f":"HideValues!$B$55&WEEKNUM(VD9,2)","v":"S18"},{"$f":"HideValues!$B$55&WEEKNUM(VE9,2)","v":"S18"},{"$f":"HideValues!$B$55&WEEKNUM(VF9,2)","v":"S19"}]
[null,null,null,null,null,null,null,null,null,null,null,null,null,null,null,null,"Planning",null,null,null,null,null,null,null,null,null,null,"Budget",null,null,null,"Commentaires",{"$f":"IF(TEXT(AG9,\"ddd\")=\"ddd\",UPPER(LEFT(TEXT(AG9,\"jjj\"),1)),UPPER(LEFT(TEXT(AG9,\"ddd\"),1)))","v":"M"},"M","J","V","S","D","L","M","M","J","V","S","D","L","M","M","J","V","S","D","L","M","M","J","V","S","D","L","M","M","J","V","S","D","L","M","M","J","V","S","D","L","M","M","J","V","S","D","L","M","M","J","V","S","D","L","M","M","J","V","S","D","L","M",{"$f":"IF(TEXT(CS9,\"ddd\")=\"ddd\",UPPER(LEFT(TEXT(CS9,\"jjj\"),1)),UPPER(LEFT(TEXT(CS9,\"ddd\"),1)))","v":"M"},"J","V","S","D","L","M","M","J","V","S","D","L","M","M","J","V","S","D","L","M","M","J","V","S","D","L","M","M","J","V","S","D","L","M","M","J","V","S","D","L","M","M","J","V","S","D","L","M","M","J","V","S","D","L","M","M","J","V","S","D","L","M","M",{"$f":"IF(TEXT(FE9,\"ddd\")=\"ddd\",UPPER(LEFT(TEXT(FE9,\"jjj\"),1)),UPPER(LEFT(TEXT(FE9,\"ddd\"),1)))","v":"J"},"V","S","D","L","M","M","J","V","S","D","L","M","M","J","V","S","D","L","M","M","J","V","S","D","L","M","M","J","V","S","D","L","M","M","J","V","S","D","L","M","M","J","V","S","D","L","M","M","J","V","S","D","L","M","M","J","V","S","D","L","M","M","J",{"$f":"IF(TEXT(HQ9,\"ddd\")=\"ddd\",UPPER(LEFT(TEXT(HQ9,\"jjj\"),1)),UPPER(LEFT(TEXT(HQ9,\"ddd\"),1)))","v":"V"},"S","D","L","M","M","J","V","S","D","L","M","M","J","V","S","D","L","M","M","J","V","S","D","L","M","M","J","V","S","D","L","M","M","J","V","S","D","L","M","M","J","V","S","D","L","M","M","J","V","S","D","L","M","M","J","V","S","D","L","M","M","J","V",{"$f":"IF(TEXT(KC9,\"ddd\")=\"ddd\",UPPER(LEFT(TEXT(KC9,\"jjj\"),1)),UPPER(LEFT(TEXT(KC9,\"ddd\"),1)))","v":"S"},"D","L","M","M","J","V","S","D","L","M","M","J","V","S","D","L","M","M","J","V","S","D","L","M","M","J","V","S","D","L","M","M","J","V","S","D","L","M","M","J","V","S","D","L","M","M","J","V","S","D","L","M","M","J","V","S","D","L","M","M","J","V","S",{"$f":"IF(TEXT(MO9,\"ddd\")=\"ddd\",UPPER(LEFT(TEXT(MO9,\"jjj\"),1)),UPPER(LEFT(TEXT(MO9,\"ddd\"),1)))","v":"D"},"L","M","M","J","V","S","D","L","M","M","J","V","S","D","L","M","M","J","V","S","D","L","M","M","J","V","S","D","L","M","M","J","V","S","D","L","M","M","J","V","S","D","L","M","M","J","V","S","D","L","M","M","J","V","S","D","L","M","M","J","V","S","D",{"$f":"IF(TEXT(PA9,\"ddd\")=\"ddd\",UPPER(LEFT(TEXT(PA9,\"jjj\"),1)),UPPER(LEFT(TEXT(PA9,\"ddd\"),1)))","v":"L"},"M","M","J","V","S","D","L","M","M","J","V","S","D","L","M","M","J","V","S","D","L","M","M","J","V","S","D","L","M","M","J","V","S","D","L","M","M","J","V","S","D","L","M","M","J","V","S","D","L","M","M","J","V","S","D","L","M","M","J","V","S","D","L",{"$f":"IF(TEXT(RM9,\"ddd\")=\"ddd\",UPPER(LEFT(TEXT(RM9,\"jjj\"),1)),UPPER(LEFT(TEXT(RM9,\"ddd\"),1)))","v":"M"},"M","J","V","S","D","L","M","M","J","V","S","D","L","M","M","J","V","S","D","L","M","M","J","V","S","D","L","M","M","J","V","S","D","L","M","M","J","V","S","D","L","M","M","J","V","S","D","L","M","M","J","V","S","D","L","M","M","J","V","S","D","L","M",{"$f":"IF(TEXT(TY9,\"ddd\")=\"ddd\",UPPER(LEFT(TEXT(TY9,\"jjj\"),1)),UPPER(LEFT(TEXT(TY9,\"ddd\"),1)))","v":"M"},"J","V","S","D","L","M","M","J","V","S","D","L","M","M","J","V","S","D","L","M","M","J","V","S","D","L","M","M","J","V","S","D","L"]
[null,null,null,null,null,null,null,null,null,null,null,null,null,null,null,null,"Resp.","Début","Durée","Jours ouvrés","Normal","Échéance","Début Recalculé","Fin Recalculée","Statut",null,null,"Estim.","Réel","%",null,null,{"$f":"AG9","v":"2016-11-08"},"2016-11-09","2016-11-10","2016-11-11","2016-11-12","2016-11-13","2016-11-14","2016-11-15","2016-11-16","2016-11-17","2016-11-18","2016-11-19","2016-11-20","2016-11-21","2016-11-22","2016-11-23","2016-11-24","2016-11-25","2016-11-26","2016-11-27","2016-11-28","2016-11-29","2016-11-30","2016-12-01","2016-12-02","2016-12-03","2016-12-04","2016-12-05","2016-12-06","2016-12-07","2016-12-08","2016-12-09","2016-12-10","2016-12-11","2016-12-12","2016-12-13","2016-12-14","2016-12-15","2016-12-16","2016-12-17","2016-12-18","2016-12-19","2016-12-20","2016-12-21","2016-12-22","2016-12-23","2016-12-24","2016-12-25","2016-12-26","2016-12-27","2016-12-28","2016-12-29","2016-12-30","2016-12-31","2017-01-01","2017-01-02","2017-01-03","2017-01-04","2017-01-05","2017-01-06","2017-01-07","2017-01-08","2017-01-09","2017-01-10",{"$f":"CS9","v":"2017-01-11"},"2017-01-12","2017-01-13","2017-01-14","2017-01-15","2017-01-16","2017-01-17","2017-01-18","2017-01-19","2017-01-20","2017-01-21","2017-01-22","2017-01-23","2017-01-24","2017-01-25","2017-01-26","2017-01-27","2017-01-28","2017-01-29","2017-01-30","2017-01-31","2017-02-01","2017-02-02","2017-02-03","2017-02-04","2017-02-05","2017-02-06","2017-02-07","2017-02-08","2017-02-09","2017-02-10","2017-02-11","2017-02-12","2017-02-13","2017-02-14","2017-02-15","2017-02-16","2017-02-17","2017-02-18","2017-02-19","2017-02-20","2017-02-21","2017-02-22","2017-02-23","2017-02-24","2017-02-25","2017-02-26","2017-02-27","2017-02-28","2017-03-01","2017-03-02","2017-03-03","2017-03-04","2017-03-05","2017-03-06","2017-03-07","2017-03-08","2017-03-09","2017-03-10","2017-03-11","2017-03-12","2017-03-13","2017-03-14","2017-03-15",{"$f":"FE9","v":"2017-03-16"},"2017-03-17","2017-03-18","2017-03-19","2017-03-20","2017-03-21","2017-03-22","2017-03-23","2017-03-24","2017-03-25","2017-03-26","2017-03-27","2017-03-28","2017-03-29","2017-03-30","2017-03-31","2017-04-01","2017-04-02","2017-04-03","2017-04-04","2017-04-05","2017-04-06","2017-04-07","2017-04-08","2017-04-09","2017-04-10","2017-04-11","2017-04-12","2017-04-13","2017-04-14","2017-04-15","2017-04-16","2017-04-17","2017-04-18","2017-04-19","2017-04-20","2017-04-21","2017-04-22","2017-04-23","2017-04-24","2017-04-25","2017-04-26","2017-04-27","2017-04-28","2017-04-29","2017-04-30","2017-05-01","2017-05-02","2017-05-03","2017-05-04","2017-05-05","2017-05-06","2017-05-07","2017-05-08","2017-05-09","2017-05-10","2017-05-11","2017-05-12","2017-05-13","2017-05-14","2017-05-15","2017-05-16","2017-05-17","2017-05-18",{"$f":"HQ9","v":"2017-05-19"},"2017-05-20","2017-05-21","2017-05-22","2017-05-23","2017-05-24","2017-05-25","2017-05-26","2017-05-27","2017-05-28","2017-05-29","2017-05-30","2017-05-31","2017-06-01","2017-06-02","2017-06-03","2017-06-04","2017-06-05","2017-06-06","2017-06-07","2017-06-08","2017-06-09","2017-06-10","2017-06-11","2017-06-12","2017-06-13","2017-06-14","2017-06-15","2017-06-16","2017-06-17","2017-06-18","2017-06-19","2017-06-20","2017-06-21","2017-06-22","2017-06-23","2017-06-24","2017-06-25","2017-06-26","2017-06-27","2017-06-28","2017-06-29","2017-06-30","2017-07-01","2017-07-02","2017-07-03","2017-07-04","2017-07-05","2017-07-06","2017-07-07","2017-07-08","2017-07-09","2017-07-10","2017-07-11","2017-07-12","2017-07-13","2017-07-14","2017-07-15","2017-07-16","2017-07-17","2017-07-18","2017-07-19","2017-07-20","2017-07-21",{"$f":"KC9","v":"2017-07-22"},"2017-07-23","2017-07-24","2017-07-25","2017-07-26","2017-07-27","2017-07-28","2017-07-29","2017-07-30","2017-07-31","2017-08-01","2017-08-02","2017-08-03","2017-08-04","2017-08-05","2017-08-06","2017-08-07","2017-08-08","2017-08-09","2017-08-10","2017-08-11","2017-08-12","2017-08-13","2017-08-14","2017-08-15","2017-08-16","2017-08-17","2017-08-18","2017-08-19","2017-08-20","2017-08-21","2017-08-22","2017-08-23","2017-08-24","2017-08-25","2017-08-26","2017-08-27","2017-08-28","2017-08-29","2017-08-30","2017-08-31","2017-09-01","2017-09-02","2017-09-03","2017-09-04","2017-09-05","2017-09-06","2017-09-07","2017-09-08","2017-09-09","2017-09-10","2017-09-11","2017-09-12","2017-09-13","2017-09-14","2017-09-15","2017-09-16","2017-09-17","2017-09-18","2017-09-19","2017-09-20","2017-09-21","2017-09-22","2017-09-23",{"$f":"MO9","v":"2017-09-24"},"2017-09-25","2017-09-26","2017-09-27","2017-09-28","2017-09-29","2017-09-30","2017-10-01","2017-10-02","2017-10-03","2017-10-04","2017-10-05","2017-10-06","2017-10-07","2017-10-08","2017-10-09","2017-10-10","2017-10-11","2017-10-12","2017-10-13","2017-10-14","2017-10-15","2017-10-16","2017-10-17","2017-10-18","2017-10-19","2017-10-20","2017-10-21","2017-10-22","2017-10-23","2017-10-24","2017-10-25","2017-10-26","2017-10-27","2017-10-28","2017-10-29","2017-10-30","2017-10-31","2017-11-01","2017-11-02","2017-11-03","2017-11-04","2017-11-05","2017-11-06","2017-11-07","2017-11-08","2017-11-09","2017-11-10","2017-11-11","2017-11-12","2017-11-13","2017-11-14","2017-11-15","2017-11-16","2017-11-17","2017-11-18","2017-11-19","2017-11-20","2017-11-21","2017-11-22","2017-11-23","2017-11-24","2017-11-25","2017-11-26",{"$f":"PA9","v":"2017-11-27"},"2017-11-28","2017-11-29","2017-11-30","2017-12-01","2017-12-02","2017-12-03","2017-12-04","2017-12-05","2017-12-06","2017-12-07","2017-12-08","2017-12-09","2017-12-10","2017-12-11","2017-12-12","2017-12-13","2017-12-14","2017-12-15","2017-12-16","2017-12-17","2017-12-18","2017-12-19","2017-12-20","2017-12-21","2017-12-22","2017-12-23","2017-12-24","2017-12-25","2017-12-26","2017-12-27","2017-12-28","2017-12-29","2017-12-30","2017-12-31","2018-01-01","2018-01-02","2018-01-03","2018-01-04","2018-01-05","2018-01-06","2018-01-07","2018-01-08","2018-01-09","2018-01-10","2018-01-11","2018-01-12","2018-01-13","2018-01-14","2018-01-15","2018-01-16","2018-01-17","2018-01-18","2018-01-19","2018-01-20","2018-01-21","2018-01-22","2018-01-23","2018-01-24","2018-01-25","2018-01-26","2018-01-27","2018-01-28","2018-01-29",{"$f":"RM9","v":"2018-01-30"},"2018-01-31","2018-02-01","2018-02-02","2018-02-03","2018-02-04","2018-02-05","2018-02-06","2018-02-07","2018-02-08","2018-02-09","2018-02-10","2018-02-11","2018-02-12","2018-02-13","2018-02-14","2018-02-15","2018-02-16","2018-02-17","2018-02-18","2018-02-19","2018-02-20","2018-02-21","2018-02-22","2018-02-23","2018-02-24","2018-02-25","2018-02-26","2018-02-27","2018-02-28","2018-03-01","2018-03-02","2018-03-03","2018-03-04","2018-03-05","2018-03-06","2018-03-07","2018-03-08","2018-03-09","2018-03-10","2018-03-11","2018-03-12","2018-03-13","2018-03-14","2018-03-15","2018-03-16","2018-03-17","2018-03-18","2018-03-19","2018-03-20","2018-03-21","2018-03-22","2018-03-23","2018-03-24","2018-03-25","2018-03-26","2018-03-27","2018-03-28","2018-03-29","2018-03-30","2018-03-31","2018-04-01","2018-04-02","2018-04-03",{"$f":"TY9","v":"2018-04-04"},"2018-04-05","2018-04-06","2018-04-07","2018-04-08","2018-04-09","2018-04-10","2018-04-11","2018-04-12","2018-04-13","2018-04-14","2018-04-15","2018-04-16","2018-04-17","2018-04-18","2018-04-19","2018-04-20","2018-04-21","2018-04-22","2018-04-23","2018-04-24","2018-04-25","2018-04-26","2018-04-27","2018-04-28","2018-04-29","2018-04-30","2018-05-01","2018-05-02","2018-05-03","2018-05-04","2018-05-05","2018-05-06","2018-05-07"]
[null,null,null,null,null,null,null,null,null,null,"0",null,"Nouvelle tâche",null,null,null,null,{"$f":"MIN(W20:W21)","v":"2016-11-09"},{"$f":"V19-R19+1","v":8},null,null,{"$f":"MAX(X20:X21)","v":"2016-11-16"},null,null,{"$f":"SUMPRODUCT(X20:X21,Y20:Y21)/SUM(X20:X21)","v":0.74999707187950193},{"$f":"R19-1+Y19*S19","v":"2016-11-13T23:59:57.976"},{"$f":"IF(Y19<>\"\",IF(AND(Y19<1,Z19<HideValues!$D$3),0,1))","v":0},{"$f":"SUM(AB20:AB21)","v":200},{"$f":"SUM(AC20:AC21)","v":10},{"$f":"IF(AND(AB19<>\"\",AC19<>\"\",AB19<>0),AC19/AB19,\"\")","v":0.05},{"$f":"AD19","v":0.05}]
[null,null,null,null,null,null,null,null,null,null,"0.1",null,"Nouvelle sous-tâche",null,null,null,"Mary","2016-11-09",5,{"$f":"WORKDAY(R20,IF(S20>0,IF(OR(WEEKDAY(R20,2)>=6,COUNTIF(Tools!$B$10:$B$57,R20)>0),S20,S20-1),IF(OR(WEEKDAY(R20,2)>=6,COUNTIF(Tools!$B$10:$B$57,R20)>0),S20,S20+1)),Tools!$B$10:$B$57)","v":"2016-11-15"},{"$f":"IF(S20>0,R20+S20-1,R20+S20+1)","v":"2016-11-13"},{"$f":"IF(R20<>\"\",IF(HideValues!$B$48,T20,U20),\"\")","v":"2016-11-15"},{"$f":"IF(S20>0,R20,V20)","v":"2016-11-09"},{"$f":"IF(S20>0,V20,R20)","v":"2016-11-15"},1,{"$f":"INT(W20+Y20*(X20-W20))","v":"2016-11-15"},{"$f":"IF(AND(Y20<1,Z20<HideValues!$D$3),0,1)","v":1},100,5,{"$f":"IF(AND(AB20<>\"\",AC20<>\"\"),AC20/AB20,\"\")","v":0.05},{"$f":"AD20","v":0.05}]
[null,null,null,null,null,null,null,null,null,null,"0.2",null,"Nouvelle sous-tâche",null,null,null,"Jade",{"$f":"$V20+1","v":"2016-11-16"},-4,{"$f":"WORKDAY(R21,IF(S21>0,IF(OR(WEEKDAY(R21,2)>=6,COUNTIF(Tools!$B$10:$B$57,R21)>0),S21,S21-1),IF(OR(WEEKDAY(R21,2)>=6,COUNTIF(Tools!$B$10:$B$57,R21)>0),S21,S21+1)),Tools!$B$10:$B$57)","v":"2016-11-11"},{"$f":"IF(S21>0,R21+S21-1,R21+S21+1)","v":"2016-11-13"},{"$f":"IF(R21<>\"\",IF(HideValues!$B$48,T21,U21),\"\")","v":"2016-11-11"},{"$f":"IF(S21>0,R21,V21)","v":"2016-11-11"},{"$f":"IF(S21>0,V21,R21)","v":"2016-11-16"},0.5,{"$f":"INT(W21+Y21*(X21-W21))","v":"2016-11-13"},{"$f":"IF(AND(Y21<1,Z21<HideValues!$D$3),0,1)","v":0},100,5,0.05,{"$f":"AD21","v":0.05}]
[null,null,null,null,null,null,null,null,null,null,"1",null,"Tâche",null,null,null,null,{"$f":"MIN(W23:W34)","v":"2016-11-09"},{"$f":"V22-R22+1","v":22},null,null,{"$f":"MAX(X23:X34)","v":"2016-11-30"},null,null,{"$f":"SUMPRODUCT(X23:X34,Y23:Y34)/SUM(X23:X34)","v":0.12497706663752015},{"$f":"R22-1+Y22*S22","v":"2016-11-10T17:59:16.408"},{"$f":"IF(Y22<>\"\",IF(AND(Y22<1,Z22<HideValues!$D$3),0,1))","v":0},{"$f":"SUM(AB23:AB34)","v":12742},{"$f":"SUM(AC23:AC34)","v":9756.74},{"$f":"IF(AND(AB22<>\"\",AC22<>\"\",AB22<>0),AC22/AB22,\"\")","v":0.76571495840527393},{"$f":"AD22","v":0.76571495840527393}]
[null,null,null,null,null,null,null,null,null,null,"1.1",1,"Sous-tâche",null,null,null,"Mary","2016-11-09",4,{"$f":"WORKDAY(R23,IF(S23>0,IF(OR(WEEKDAY(R23,2)>=6,COUNTIF(Tools!$B$10:$B$57,R23)>0),S23,S23-1),IF(OR(WEEKDAY(R23,2)>=6,COUNTIF(Tools!$B$10:$B$57,R23)>0),S23,S23+1)),Tools!$B$10:$B$57)","v":"2016-11-14"},{"$f":"IF(S23>0,R23+S23-1,R23+S23+1)","v":"2016-11-12"},{"$f":"IF(R23<>\"\",IF(HideValues!$B$48,T23,U23),\"\")","v":"2016-11-14"},{"$f":"IF(S23>0,R23,V23)","v":"2016-11-09"},{"$f":"IF(S23>0,V23,R23)","v":"2016-11-14"},1,{"$f":"INT(W23+Y23*(X23-W23))","v":"2016-11-14"},{"$f":"IF(AND(Y23<1,Z23<HideValues!$D$3),0,1)","v":1},7536,7309.92,{"$f":"IF(AND(AB23<>\"\",AC23<>\"\"),AC23/AB23,\"\")","v":0.97},{"$f":"AD23","v":0.97}]
[null,null,null,null,null,null,null,null,null,null,"1.2",3,"Sous-tâche",null,null,null,"Jade",{"$f":"$V23+1","v":"2016-11-15"},-4,{"$f":"WORKDAY(R24,IF(S24>0,IF(OR(WEEKDAY(R24,2)>=6,COUNTIF(Tools!$B$10:$B$57,R24)>0),S24,S24-1),IF(OR(WEEKDAY(R24,2)>=6,COUNTIF(Tools!$B$10:$B$57,R24)>0),S24,S24+1)),Tools!$B$10:$B$57)","v":"2016-11-10"},{"$f":"IF(S24>0,R24+S24-1,R24+S24+1)","v":"2016-11-12"},{"$f":"IF(R24<>\"\",IF(HideValues!$B$48,T24,U24),\"\")","v":"2016-11-10"},{"$f":"IF(S24>0,R24,V24)","v":"2016-11-10"},{"$f":"IF(S24>0,V24,R24)","v":"2016-11-15"},0.5,{"$f":"INT(W24+Y24*(X24-W24))","v":"2016-11-12"},{"$f":"IF(AND(Y24<1,Z24<HideValues!$D$3),0,1)","v":0},5206,2446.8200000000002,0.47000000000000003,{"$f":"AD24","v":0.47000000000000003}]
[null,null,null,null,null,null,null,null,null,null,"1.3",2,"Sous-tâche",null,null,null,"Reda",{"$f":"$V24+1","v":"2016-11-11"},3,{"$f":"WORKDAY(R25,IF(S25>0,IF(OR(WEEKDAY(R25,2)>=6,COUNTIF(Tools!$B$10:$B$57,R25)>0),S25,S25-1),IF(OR(WEEKDAY(R25,2)>=6,COUNTIF(Tools!$B$10:$B$57,R25)>0),S25,S25+1)),Tools!$B$10:$B$57)","v":"2016-11-15"},"2016-11-13",{"$f":"IF(R25<>\"\",IF(HideValues!$B$48,T25,U25),\"\")","v":"2016-11-15"},"2016-11-11","2016-11-15",null,"2016-11-11",{"$f":"IF(AND(Y25<1,Z25<HideValues!$D$3),0,1)","v":0},null,null,null,0]
[null,null,null,null,null,null,null,null,null,null,"1.4",1,"Sous-tâche",null,null,null,"Reda",{"$f":"R25+7","v":"2016-11-18"},2,{"$f":"WORKDAY(R26,IF(S26>0,IF(OR(WEEKDAY(R26,2)>=6,COUNTIF(Tools!$B$10:$B$57,R26)>0),S26,S26-1),IF(OR(WEEKDAY(R26,2)>=6,COUNTIF(Tools!$B$10:$B$57,R26)>0),S26,S26+1)),Tools!$B$10:$B$57)","v":"2016-11-21"},"2016-11-19",{"$f":"IF(R26<>\"\",IF(HideValues!$B$48,T26,U26),\"\")","v":"2016-11-21"},"2016-11-18","2016-11-21",null,"2016-11-18",{"$f":"IF(AND(Y26<1,Z26<HideValues!$D$3),0,1)","v":1},null,null,null,0]
[null,null,null,null,null,null,null,null,null,null,"1.5",2,"Sous-tâche",null,null,null,"Reda",{"$f":"R26+7","v":"2016-11-25"},1,{"$f":"WORKDAY(R27,IF(S27>0,IF(OR(WEEKDAY(R27,2)>=6,COUNTIF(Tools!$B$10:$B$57,R27)>0),S27,S27-1),IF(OR(WEEKDAY(R27,2)>=6,COUNTIF(Tools!$B$10:$B$57,R27)>0),S27,S27+1)),Tools!$B$10:$B$57)","v":"2016-11-25"},"2016-11-25",{"$f":"IF(R27<>\"\",IF(HideValues!$B$48,T27,U27),\"\")","v":"2016-11-25"},"2016-11-25","2016-11-25",null,"2016-11-25",{"$f":"IF(AND(Y27<1,Z27<HideValues!$D$3),0,1)","v":1},null,null,null,{"$f":"AD27","v":0}]
[null,null,null,null,null,null,null,null,null,null,"1.6",null,"Sous-tâche",null,null,null,"Mike",{"$f":"V24","v":"2016-11-10"},4,{"$f":"WORKDAY(R28,IF(S28>0,IF(OR(WEEKDAY(R28,2)>=6,COUNTIF(Tools!$B$10:$B$57,R28)>0),S28,S28-1),IF(OR(WEEKDAY(R28,2)>=6,COUNTIF(Tools!$B$10:$B$57,R28)>0),S28,S28+1)),Tools!$B$10:$B$57)","v":"2016-11-15"},"2016-11-13",{"$f":"IF(R28<>\"\",IF(HideValues!$B$48,T28,U28),\"\")","v":"2016-11-15"},"2016-11-10","2016-11-15",null,"2016-11-10",{"$f":"IF(AND(Y28<1,Z28<HideValues!$D$3),0,1)","v":0},null,null,null,{"$f":"AD28","v":0}]
[null,null,null,null,null,null,null,null,null,null,"1.7",null,"Sous-tâche",null,null,null,"Sara","2016-11-20",5,{"$f":"WORKDAY(R29,IF(S29>0,IF(OR(WEEKDAY(R29,2)>=6,COUNTIF(Tools!$B$10:$B$57,R29)>0),S29,S29-1),IF(OR(WEEKDAY(R29,2)>=6,COUNTIF(Tools!$B$10:$B$57,R29)>0),S29,S29+1)),Tools!$B$10:$B$57)","v":"2016-11-25"},"2016-11-24",{"$f":"IF(R29<>\"\",IF(HideValues!$B$48,T29,U29),\"\")","v":"2016-11-25"},"2016-11-20","2016-11-25",null,"2016-11-20",{"$f":"IF(AND(Y29<1,Z29<HideValues!$D$3),0,1)","v":1},null,null,null,{"$f":"AD29","v":0}]
[null,null,null,null,null,null,null,null,null,null,"1.8",1,"Sous-tâche",null,null,null,"Sara","2016-11-22",5,{"$f":"WORKDAY(R30,IF(S30>0,IF(OR(WEEKDAY(R30,2)>=6,COUNTIF(Tools!$B$10:$B$57,R30)>0),S30,S30-1),IF(OR(WEEKDAY(R30,2)>=6,COUNTIF(Tools!$B$10:$B$57,R30)>0),S30,S30+1)),Tools!$B$10:$B$57)","v":"2016-11-28"},"2016-11-26",{"$f":"IF(R30<>\"\",IF(HideValues!$B$48,T30,U30),\"\")","v":"2016-11-28"},"2016-11-22","2016-11-28",null,"2016-11-22",{"$f":"IF(AND(Y30<1,Z30<HideValues!$D$3),0,1)","v":1},null,null,null,0]
[null,null,null,null,null,null,null,null,null,null,"1.9",null,"Sous-tâche",null,null,null,"Sara","2016-11-20",5,{"$f":"WORKDAY(R31,IF(S31>0,IF(OR(WEEKDAY(R31,2)>=6,COUNTIF(Tools!$B$10:$B$57,R31)>0),S31,S31-1),IF(OR(WEEKDAY(R31,2)>=6,COUNTIF(Tools!$B$10:$B$57,R31)>0),S31,S31+1)),Tools!$B$10:$B$57)","v":"2016-11-25"},"2016-11-24",{"$f":"IF(R31<>\"\",IF(HideValues!$B$48,T31,U31),\"\")","v":"2016-11-25"},"2016-11-20","2016-11-25",null,"2016-11-20",{"$f":"IF(AND(Y31<1,Z31<HideValues!$D$3),0,1)","v":1},null,null,null,{"$f":"AD31","v":0}]
[null,null,null,null,null,null,null,null,null,null,"1.10",null,"Sous-tâche",null,null,null,"Mike","2016-11-23",3,{"$f":"WORKDAY(R32,IF(S32>0,IF(OR(WEEKDAY(R32,2)>=6,COUNTIF(Tools!$B$10:$B$57,R32)>0),S32,S32-1),IF(OR(WEEKDAY(R32,2)>=6,COUNTIF(Tools!$B$10:$B$57,R32)>0),S32,S32+1)),Tools!$B$10:$B$57)","v":"2016-11-25"},"2016-11-25",{"$f":"IF(R32<>\"\",IF(HideValues!$B$48,T32,U32),\"\")","v":"2016-11-25"},"2016-11-23","2016-11-25",null,"2016-11-23",{"$f":"IF(AND(Y32<1,Z32<HideValues!$D$3),0,1)","v":1},null,null,null,0]
[null,null,null,null,null,null,null,null,null,null,"1.11",null,"Sous-tâche",null,null,null,"Mike",{"$f":"V32+1","v":"2016-11-26"},1,{"$f":"WORKDAY(R33,IF(S33>0,IF(OR(WEEKDAY(R33,2)>=6,COUNTIF(Tools!$B$10:$B$57,R33)>0),S33,S33-1),IF(OR(WEEKDAY(R33,2)>=6,COUNTIF(Tools!$B$10:$B$57,R33)>0),S33,S33+1)),Tools!$B$10:$B$57)","v":"2016-11-28"},"2016-11-26",{"$f":"IF(R33<>\"\",IF(HideValues!$B$48,T33,U33),\"\")","v":"2016-11-28"},"2016-11-26","2016-11-28",null,"2016-11-26",{"$f":"IF(AND(Y33<1,Z33<HideValues!$D$3),0,1)","v":1},null,null,null,{"$f":"AD33","v":0}]
[null,null,null,null,null,null,null,null,null,null,"1.12",null,"Sous-tâche",null,null,null,"Reda",{"$f":"V33+1","v":"2016-11-29"},2,{"$f":"WORKDAY(R34,IF(S34>0,IF(OR(WEEKDAY(R34,2)>=6,COUNTIF(Tools!$B$10:$B$57,R34)>0),S34,S34-1),IF(OR(WEEKDAY(R34,2)>=6,COUNTIF(Tools!$B$10:$B$57,R34)>0),S34,S34+1)),Tools!$B$10:$B$57)","v":"2016-11-30"},"2016-11-30",{"$f":"IF(R34<>\"\",IF(HideValues!$B$48,T34,U34),\"\")","v":"2016-11-30"},"2016-11-29","2016-11-30",null,"2016-11-29",{"$f":"IF(AND(Y34<1,Z34<HideValues!$D$3),0,1)","v":1},null,null,null,{"$f":"AD34","v":0}]
[null,null,null,null,null,null,null,null,null,null,"2",null,"Tâche",null,null,null,null,{"$f":"MIN(W36:W38)","v":"2016-11-25"},{"$f":"V35-R35+1","v":7},null,null,{"$f":"MAX(X36:X38)","v":"2016-12-01"},null,null,{"$f":"SUMPRODUCT(X36:X38,Y36:Y38)/SUM(X36:X38)","v":0.66663544179293222},{"$f":"R35+Y35*(S35-1)","v":"2016-11-28T23:59:43.813"},{"$f":"IF(Y35<>\"\",IF(AND(Y35<1,Z35<HideValues!$D$3),0,1))","v":1},{"$f":"SUM(AB36:AB38)","v":10412},{"$f":"SUM(AC36:AC38)","v":7446.82},{"$f":"IF(AND(AB35<>\"\",AC35<>\"\",AB35<>0),AC35/AB35,\"\")","v":0.71521513638109868},{"$f":"AD35","v":0.71521513638109868}]
[null,null,null,null,null,null,null,null,null,null,"2.1",null,"Sous-tâche",null,null,null,"Leo","2016-11-25",1,{"$f":"WORKDAY(R36,IF(S36>0,IF(OR(WEEKDAY(R36,2)>=6,COUNTIF(Tools!$B$10:$B$57,R36)>0),S36,S36-1),IF(OR(WEEKDAY(R36,2)>=6,COUNTIF(Tools!$B$10:$B$57,R36)>0),S36,S36+1)),Tools!$B$10:$B$57)","v":"2016-11-25"},{"$f":"IF(S36>0,R36+S36-1,R36+S36+1)","v":"2016-11-25"},{"$f":"IF(R36<>\"\",IF(HideValues!$B$48,T36,U36),\"\")","v":"2016-11-25"},{"$f":"IF(S36>0,R36,V36)","v":"2016-11-25"},{"$f":"IF(S36>0,V36,R36)","v":"2016-11-25"},1,{"$f":"INT(R36+Y36*(V36-R36))","v":"2016-11-25"},{"$f":"IF(AND(Y36<1,Z36<HideValues!$D$3),0,1)","v":1},5206,5000,{"$f":"IF(AND(AB36<>\"\",AC36<>\"\"),AC36/AB36,\"\")","v":0.9604302727621975},{"$f":"AD36","v":0.9604302727621975}]
[null,null,null,null,null,null,null,null,null,null,"2.2",1,"Sous-tâche",null,null,null,"Jade","2016-11-25",1,{"$f":"WORKDAY(R37,IF(S37>0,IF(OR(WEEKDAY(R37,2)>=6,COUNTIF(Tools!$B$10:$B$57,R37)>0),S37,S37-1),IF(OR(WEEKDAY(R37,2)>=6,COUNTIF(Tools!$B$10:$B$57,R37)>0),S37,S37+1)),Tools!$B$10:$B$57)","v":"2016-11-25"},{"$f":"IF(S37>0,R37+S37-1,R37+S37+1)","v":"2016-11-25"},{"$f":"IF(R37<>\"\",IF(HideValues!$B$48,T37,U37),\"\")","v":"2016-11-25"},{"$f":"IF(S37>0,R37,V37)","v":"2016-11-25"},{"$f":"IF(S37>0,V37,R37)","v":"2016-11-25"},1,{"$f":"INT(W37+Y37*(X37-W37))","v":"2016-11-25"},{"$f":"IF(AND(Y37<1,Z37<HideValues!$D$3),0,1)","v":1},5206,2446.8200000000002,{"$f":"IF(AND(AB37<>\"\",AC37<>\"\"),AC37/AB37,\"\")","v":0.47000000000000003},{"$f":"AD37","v":0.47000000000000003}]
[null,null,null,null,null,null,null,null,null,null,"2.3",null,"Sous-tâche",null,null,null,"Jade","2016-11-25",5,{"$f":"WORKDAY(R38,IF(S38>0,IF(OR(WEEKDAY(R38,2)>=6,COUNTIF(Tools!$B$10:$B$57,R38)>0),S38,S38-1),IF(OR(WEEKDAY(R38,2)>=6,COUNTIF(Tools!$B$10:$B$57,R38)>0),S38,S38+1)),Tools!$B$10:$B$57)","v":"2016-12-01"},"2016-11-29",{"$f":"IF(R38<>\"\",IF(HideValues!$B$48,T38,U38),\"\")","v":"2016-12-01"},"2016-11-25","2016-12-01",null,{"$f":"INT(R38+Y38*(V38-R38))","v":"2016-11-25"},{"$f":"IF(AND(Y38<1,Z38<HideValues!$D$3),0,1)","v":1},null,null,null,{"$f":"AD38","v":0}]
[null,null,null,null,null,null,null,null,null,null,"3",null,"Tâche",null,null,null,null,{"$f":"MIN(W40:W41)","v":"2016-11-09"},{"$f":"V39-R39+1","v":7},null,null,{"$f":"MAX(X40:X41)","v":"2016-11-15"},null,null,{"$f":"SUMPRODUCT(X40:X41,Y40:Y41)/SUM(X40:X41)","v":1},{"$f":"R39-1+Y39*S39","v":"2016-11-15"},{"$f":"IF(Y39<>\"\",IF(AND(Y39<1,Z39<HideValues!$D$3),0,1))","v":1},{"$f":"SUM(AB40:AB41)","v":200},{"$f":"SUM(AC40:AC41)","v":10},{"$f":"IF(AND(AB39<>\"\",AC39<>\"\",AB39<>0),AC39/AB39,\"\")","v":0.05},0.05]
[null,null,null,null,null,null,null,null,null,null,"3.1",null,"Sous-tâche",null,null,null,"Mary","2016-11-09",5,{"$f":"WORKDAY(R40,IF(S40>0,IF(OR(WEEKDAY(R40,2)>=6,COUNTIF(Tools!$B$10:$B$57,R40)>0),S40,S40-1),IF(OR(WEEKDAY(R40,2)>=6,COUNTIF(Tools!$B$10:$B$57,R40)>0),S40,S40+1)),Tools!$B$10:$B$57)","v":"2016-11-15"},{"$f":"IF(S40>0,R40+S40-1,R40+S40+1)","v":"2016-11-13"},{"$f":"IF(R40<>\"\",IF(HideValues!$B$48,T40,U40),\"\")","v":"2016-11-15"},{"$f":"IF(S40>0,R40,V40)","v":"2016-11-09"},{"$f":"IF(S40>0,V40,R40)","v":"2016-11-15"},1,{"$f":"INT(W40+Y40*(X40-W40))","v":"2016-11-15"},{"$f":"IF(AND(Y40<1,Z40<HideValues!$D$3),0,1)","v":1},100,5,{"$f":"IF(AND(AB40<>\"\",AC40<>\"\"),AC40/AB40,\"\")","v":0.05},0.05]
[null,null,null,null,null,null,null,null,null,null,"3.2",null,"Sous-tâche",null,null,null,"Mary","2016-11-09",5,{"$f":"WORKDAY(R41,IF(S41>0,IF(OR(WEEKDAY(R41,2)>=6,COUNTIF(Tools!$B$10:$B$57,R41)>0),S41,S41-1),IF(OR(WEEKDAY(R41,2)>=6,COUNTIF(Tools!$B$10:$B$57,R41)>0),S41,S41+1)),Tools!$B$10:$B$57)","v":"2016-11-15"},"2016-11-13",{"$f":"IF(R41<>\"\",IF(HideValues!$B$48,T41,U41),\"\")","v":"2016-11-15"},"2016-11-09","2016-11-15",1,"2016-11-15",{"$f":"IF(AND(Y41<1,Z41<HideValues!$D$3),0,1)","v":1},100,5,0.05,0.05]

{"sheet":"Tools","index":1,"n_rows":18,"n_cols":9,"rows_kept":18,"cut":false,"hidden":true,"merged":[[8,3,8,8]]}
[]
[]
[]
[]
[]
[]
[]
[]
[null,"Jours de congé",null,"Equipe projet"]
[null,"2014-01-01",null,"Diminutif","Nom complet","Entreprise","Division","Email","Téléphone"]
[null,"2014-05-01",null,"Gibs","Gibs Solar","ABC Company","Project Leader","gibs.solar@abc.com","05-777-4556"]
[null,"2014-12-25",null,"Sara","Sara Donaldson","ABC Company","Purchasing","sara.donaldson@abc.com","05-777-8904"]
[null,null,null,"Mary","Mary Nichols","ABC Company","PE","mary.nichols@abc.com","05-777-4905"]
[null,null,null,"Jade","Jade Rendal","ABC Company","QC","jade.rendal@abc.com","05-777-3489"]
[null,null,null,"Reda","Reda Achraf","ABC Company","Marketing","reda.achraf@abc.com","05-777-3456"]
[null,null,null,"Mike","Mike Ibra","ABC Company","A&F","mike.ibra@abc.com","05-777-2354"]
[null,null,null,"Tony","Tony Barlen","ABC Company","R&D","tony.barlen@abc.com","05-777-3453"]
[null,null,null,"Leo","Leo Zadna","Supplier XYZ","Manufacturing","leo.zadna@xyz.com","09-333-6533"]

{"sheet":"TranslationTable","index":2,"n_rows":193,"n_cols":12,"rows_kept":193,"cut":false,"hidden":true,"merged":[]}
["Translation Table"]
[]
["Language Table"]
["English",9]
["French",10]
["Spanish",11]
["German",12]
[]
[]
[]
[]
[]
[]
[]
["Current Language",10]
[]
[]
["Translation Table",null,null,null,null,null,null,null,null,null,"Corrected"]
["Category","Object Type","Object Name","Sheet","Cell Row","Cell Column","Currently Displayed","(Free for new language)","English","French","Spanish","German"]
["Left Panel","Text Box","left_panel_1","Gantt",null,null,null,null,"Starting Date","Date de départ","Fecha de inicio","Starttag"]
["Left Panel","Text Box","left_panel_2","Gantt",null,null,null,null,"Select the starting date of the gantt chart","Veuillez choisir la date à laquelle le diagramme doit démarrer","Seleccione la fecha de inicio del diagrama de Gantt","Wählen Sie die Startzeit der Gantt-Diagramm"]
["Left Panel","Text Box","left_panel_3","Gantt",null,null,null,null,"Today","Aujourd'hui","Hoy","Heutzutage"]
["Left Panel","Text Box","left_panel_4","Gantt",null,null,null,null,"Auto ","Automatique","Automático","Automatisch"]
["Left Panel","Text Box","left_panel_5","Gantt",null,null,null,null,"Bookmark","Marque-page","Marcador","Lesezeichen"]
["Left Panel","Text Box","left_panel_6","Gantt",null,null,null,null,"Select the date that will be shown with a red line in the gantt chart","Veuillez choisir la date du marque-page","Seleccione la fecha que se mostrará con una línea roja en el gráfico","Wählen Sie das Datum das wird mit einer roten Linie angezeigt werden"]
["Left Panel","Text Box","left_panel_7","Gantt",null,null,null,null,"Working Days","Jours ouvrés","Días hábiles","Arbeitstage"]
["Left Panel","Text Box","left_panel_8","Gantt",null,null,null,null,"Select the working days that apply for your project","Veuillez choisir les jours ouvrés qui s'appliquent à votre projet","Seleccione los días hábiles que aplican para su proyecto","Wählen Sie die Arbeitstage, die für Ihr Projekt anwenden"]
["Left Panel","Text Box","left_panel_9","Gantt",null,null,null,null,"Week Symbol","Préfixe des semaines","Símbolo de semana","Woche Symbol"]
["Left Panel","Text Box","left_panel_10","Gantt",null,null,null,null,"Select how to display week numbers","Veuillez choisir le préfixe utilisé pour les numéros de semaines","Seleccione la presentación de números de la semana","Wählen Sie, wie Sie Wochennummern anzeigen"]
["Left Panel","Text Box","left_panel_11","Gantt",null,null,null,null,"Optional","Optionnel","Opcional","Optional"]
["Left Panel","Text Box","left_panel_14","Gantt",null,null,null,null,"Show Flag","Afficher les drapeaux","Mostrar marcas","Flagge anzeigen"]
["Left Panel","Text Box","left_panel_15","Gantt",null,null,null,null,"Show Comments","Afficher les commentaires","Mostrar comentarios","Kommentare anzeigen"]
["Left Panel","Text Box","left_panel_16","Gantt",null,null,null,null,"Reminder to enable macros at start-up ","Rappel à l'ouverture pour activer les macros","Recordatorio para habilitar las macros al comenzar","Erinnerung für Makros aktivieren"]
["Left Panel","Text Box","left_panel_17","Gantt",null,null,null,null,"Weekend days:","Jours de week-end:","Días de fin de semana:","Tage Wochenende:"]
["Left Panel","Text Box","left_panel_18","Gantt",null,null,null,null,"First day of the week:","Premier jour de semaine:","Primer día de la semana:","Erster Tag der Woche:"]
["Left Panel","Text Box","popup-help-title","Gantt",null,null,null,null,"How to fill the start date ?","Saisir la date de début","¿Cómo llenar las fechas de inicio?",{"$f":"I36","v":"How to fill the start date ?"}]
["Left Panel","Text Box","popup-help-core","Gantt",null,null,null,null,"From the drop-down menu, you can select \"After Previous\" to start your task just after the previous one or \"With Previous\" to start your task at the same date as the previous one.\nIf you wish to input manually any specific date, just type it in the cell.","A partir du menu déroulant, vous pouvez choisir \"Après précédent\" pour commencer la tâche dès que la tâche précédente est terminée ou \"Avec précédent\" pour la faire débuter en même temps. Si vous souhaitez introduire manuellement une autre date, il suffit de la saisir dans la cellule.","En el menú desplegable, puede seleccionar \"Después de la anterior\" para iniciar su tarea justo después de la anterior o \"Con la anterior\" \"para iniciar su tarea en el mismo momento de la anterior.\nSi desea introducir manualmente una fecha específica, ingrésela en la celda.",{"$f":"I37","v":"From the drop-down menu, you can select \"After Previous\" to start your task just after the previous one or \"With Previous\" to start your task at the same date as the previous one.\nIf you wish to input manually any specific date, just type it in the cell."}]
["Left Panel","Text Box","popup-help-link","Gantt",null,null,null,null,"For more details, visit our online support page.","Pour plus d'aide, visitez notre page de support.","Para más detalles, visite nuestra página de soporte en línea.","For more details, visit our online support page."]
["Left Panel","Hyperlink","popup-help-link","Gantt",null,null,null,null,{"$f":"I180","v":"https://gestionprojetauto.wordpress.com/support-excel-gantt-chart-maker"},{"$f":"$J$180","v":"https://gestionprojetauto.wordpress.com/support-diagramme-de-gantt"},{"$f":"I39","v":"https://gestionprojetauto.wordpress.com/support-excel-gantt-chart-maker"},{"$f":"I39","v":"https://gestionprojetauto.wordpress.com/support-excel-gantt-chart-maker"}]
["Gantt Chart Titles","Cell",null,"Gantt",{"$f":"ROW(Gantt!$Q$17)","v":17},{"$f":"COLUMN(Gantt!$Q$17)","v":17},null,null,"Schedule","Planning","Horario","Zeitplan"]
["Gantt Chart Titles","Cell",null,"Gantt",{"$f":"ROW(Gantt!$Q$18)","v":18},{"$f":"COLUMN(Gantt!$Q$18)","v":17},null,null,"Leader","Resp.","Líder","Betreuer"]
["Gantt Chart Titles","Cell",null,"Gantt",{"$f":"ROW(Gantt!$R$18)","v":18},{"$f":"COLUMN(Gantt!$R$18)","v":18},null,null,"Start","Début","Comienzo","Starttag"]
["Gantt Chart Titles","Cell",null,"Gantt",{"$f":"ROW(Gantt!$S$18)","v":18},{"$f":"COLUMN(Gantt!$S$18)","v":19},null,null,"Duration","Durée","Duración","Dauer"]
["Gantt Chart Titles","Cell",null,"Gantt",{"$f":"ROW(Gantt!$T$18)","v":18},{"$f":"COLUMN(Gantt!$T$18)","v":20},null,null,"W.Day","Jours ouvrés","Los días hábiles","W.Day"]
["Gantt Chart Titles","Cell",null,"Gantt",{"$f":"ROW(Gantt!$U$18)","v":18},{"$f":"COLUMN(Gantt!$U$18)","v":21},null,null,"All.Days","Normal","Todos los Días","All.Days"]
["Gantt Chart Titles","Cell",null,"Gantt",{"$f":"ROW(Gantt!$V$18)","v":18},{"$f":"COLUMN(Gantt!$V$18)","v":22},null,null,"Due","Échéance","Terminación ","Fällig am"]
["Gantt Chart Titles","Cell",null,"Gantt",{"$f":"ROW(Gantt!$Y$18)","v":18},{"$f":"COLUMN(Gantt!$Y$18)","v":25},null,null,"Progress","Statut","Estado","Status"]
["Gantt Chart Titles","Cell",null,"Gantt",{"$f":"ROW(Gantt!$AB$17)","v":17},{"$f":"COLUMN(Gantt!$AB$17)","v":28},null,null,"Budget","Budget","Presupuesto","Budget"]
["Gantt Chart Titles","Cell",null,"Gantt",{"$f":"ROW(Gantt!$AB$18)","v":18},{"$f":"COLUMN(Gantt!$AB$18)","v":28},null,null,"Plan","Estim.","Estimado","Schätzung"]
["Gantt Chart Titles","Cell",null,"Gantt",{"$f":"ROW(Gantt!$AC$18)","v":18},{"$f":"COLUMN(Gantt!$AC$18)","v":29},null,null,"Actual","Réel","Real","Tatsächlichen"]
["Gantt Chart Titles","Cell",null,"Gantt",{"$f":"ROW(Gantt!$AD$18)","v":18},{"$f":"COLUMN(Gantt!$AD$18)","v":30},null,null,"%","%","%","%"]
["Gantt Chart Titles","Cell",null,"Gantt",{"$f":"ROW(Gantt!$AF$17)","v":17},{"$f":"COLUMN(Gantt!$AF$17)","v":32},null,null,"Comments","Commentaires","Comentarios","Kommentare"]
["Gantt Chart Titles","Cell",null,"Gantt",{"$f":"ROW(Gantt!$WF$18)","v":18},{"$f":"COLUMN(Gantt!$W$18)","v":23},null,null,"Recalculated start","Début Recalculé","Recalculated start","Recalculated start"]
["Gantt Chart Titles","Cell",null,"Gantt",{"$f":"ROW(Gantt!$X$18)","v":18},{"$f":"COLUMN(Gantt!$X$18)","v":24},null,null,"Recalculated end","Fin Recalculée","Recalculated end","Recalculated end"]
["Gantt Chart Titles (monthly view)","Cell",null,"Gantt",15,{"$f":"COLUMN(Gantt!$Q$18)","v":17},null,null,{"$f":"I41","v":"Leader"},{"$f":"J41","v":"Resp."},{"$f":"K41","v":"Líder"},{"$f":"L41","v":"Betreuer"}]
["Gantt Chart Titles (monthly view)","Cell",null,"Gantt",15,{"$f":"COLUMN(Gantt!$R$18)","v":18},null,null,{"$f":"I42","v":"Start"},{"$f":"J42","v":"Début"},{"$f":"K42","v":"Comienzo"},{"$f":"L42","v":"Starttag"}]
["Gantt Chart Titles (monthly view)","Cell",null,"Gantt",15,{"$f":"COLUMN(Gantt!$S$18)","v":19},null,null,{"$f":"I43","v":"Duration"},{"$f":"J43","v":"Durée"},{"$f":"K43","v":"Duración"},{"$f":"L43","v":"Dauer"}]
["Gantt Chart Titles (monthly view)","Cell",null,"Gantt",15,{"$f":"COLUMN(Gantt!$T$18)","v":20},null,null,{"$f":"I44","v":"W.Day"},{"$f":"J44","v":"Jours ouvrés"},{"$f":"K44","v":"Los días hábiles"},{"$f":"L44","v":"W.Day"}]
["Gantt Chart Titles (monthly view)","Cell",null,"Gantt",15,{"$f":"COLUMN(Gantt!$U$18)","v":21},null,null,{"$f":"I45","v":"All.Days"},{"$f":"J45","v":"Normal"},{"$f":"K45","v":"Todos los Días"},{"$f":"L45","v":"All.Days"}]
["Gantt Chart Titles (monthly view)","Cell",null,"Gantt",15,{"$f":"COLUMN(Gantt!$V$18)","v":22},null,null,{"$f":"I46","v":"Due"},{"$f":"J46","v":"Échéance"},{"$f":"K46","v":"Terminación "},{"$f":"L46","v":"Fällig am"}]
["Gantt Chart Titles (monthly view)","Cell",null,"Gantt",15,{"$f":"COLUMN(Gantt!$Y$18)","v":25},null,null,{"$f":"I47","v":"Progress"},{"$f":"J47","v":"Statut"},{"$f":"K47","v":"Estado"},{"$f":"L47","v":"Status"}]
["Gantt Chart Titles (monthly view)","Cell",null,"Gantt",15,{"$f":"COLUMN(Gantt!$AB$18)","v":28},null,null,{"$f":"I49","v":"Plan"},{"$f":"J49","v":"Estim."},{"$f":"K49","v":"Estimado"},{"$f":"L49","v":"Schätzung"}]
["Gantt Chart Titles (monthly view)","Cell",null,"Gantt",15,{"$f":"COLUMN(Gantt!$AC$18)","v":29},null,null,{"$f":"I50","v":"Actual"},{"$f":"J50","v":"Réel"},{"$f":"K50","v":"Real"},{"$f":"L50","v":"Tatsächlichen"}]
["Gantt Chart Titles (monthly view)","Cell",null,"Gantt",15,{"$f":"COLUMN(Gantt!$AD$18)","v":30},null,null,{"$f":"I51","v":"%"},{"$f":"J51","v":"%"},{"$f":"K51","v":"%"},{"$f":"L51","v":"%"}]
["Gantt Chart Titles (monthly view)","Cell",null,"Gantt",15,{"$f":"COLUMN(Gantt!$AF$17)","v":32},null,null,{"$f":"I52","v":"Comments"},{"$f":"J52","v":"Commentaires"},{"$f":"K52","v":"Comentarios"},{"$f":"L52","v":"Kommentare"}]
["Gantt Chart (New Tasks)","Cell",null,"Gantt",{"$f":"ROW(Gantt!$M$19)","v":19},{"$f":"COLUMN(Gantt!$M$19)","v":13},null,null,"New Task","Nouvelle tâche","Nueva tarea","Neue Aufgabe"]
["Gantt Chart (New Tasks)","Cell",null,"Gantt",{"$f":"ROW(Gantt!$M$20)","v":20},{"$f":"COLUMN(Gantt!$M$20)","v":13},null,null,"New Sub-Task","Nouvelle sous-tâche","Nueva sub-tarea","Neue Unteraufgabe"]
["Gantt Chart (New Tasks)","Cell",null,"Gantt",{"$f":"ROW(Gantt!$M$21)","v":21},{"$f":"COLUMN(Gantt!$M$21)","v":13},null,null,{"$f":"I67","v":"New Sub-Task"},{"$f":"J67","v":"Nouvelle sous-tâche"},"Nueva sub-tarea","Neue Unteraufgabe"]
["Gantt Chart Titles","Text Box","Gantt_Title1","Gantt",null,null,null,null,"Project Title","Nom du projet","Nombre del proyecto","Projektnamen"]
["Gantt Chart Titles","Text Box","Gantt_Title2","Gantt",null,null,null,null,"Subtitle for additional details","Sous-titre pour plus de détails","Subtítulos para detalles adicionales ","Untertitel für details"]
["Drop Down Menu","Text Box","menu_txt1","Gantt",null,null,null,null,"View","Affichage","Vista","Ansicht"]
["Drop Down Menu","Text Box","menu_txt2","Gantt",null,null,null,null,"Tools","Outils","Herramientas","Tools"]
["Drop Down Menu","Text Box","menu_txt3","Gantt",null,null,null,null,"Help","Aide","Ayuda","Hilfe"]
["Drop Down Menu","Text Box","menu_txt4","Gantt",null,null,null,null,"About","À propos","Acerca de","Über"]
["Drop Down Menu","Text Box","menu_txt5","Gantt",null,null,null,null,"Language","Langue","Idioma","Sprache"]
["View Drop Down Menu","Text Box","expand1_txt","Gantt",null,null,null,null,"Expand the view","Plein écran simple","Expandir","Einfache vollbild"]
["View Drop Down Menu","Text Box","expand2_txt","Gantt",null,null,null,null,"Expand view and lock side and top","Plein écran verrouillé","Expandir y bloquear pantalla","Vollbild gesperrt"]
["View Drop Down Menu","Text Box","expand3_txt","Gantt",null,null,null,null,"Full Screen Mode","Mode plein écran","Pantalla completa","Vollbildmodus"]
["View Drop Down Menu","Text Box","expand4_txt","Gantt",null,null,null,null,"Type of Gantt","Type de Gantt","Tipo de Gantt","Diagrammtyp"]
["View Drop Down Menu","Text Box","expand5_txt","Gantt",null,null,null,null,"Show Daily","Quotidien","Mostrar diario","Tagesansicht"]
["View Drop Down Menu","Text Box","expand6_txt","Gantt",null,null,null,null,"Show Weekly","Hebdomadaire","Mostrar semanal","Wochensicht "]
["View Drop Down Menu","Text Box","expand7_txt","Gantt",null,null,null,null,"Show Monthly","Mensuel","Mostrar mensual","Monatlich"]
["View Drop Down Menu","Text Box","expand_cancel","Gantt",null,null,null,null,"Close","Fermer","Cerrar","Schließen"]
["View Drop Down Menu","Text Box","cancel_full_scr1","Gantt",null,null,null,null,"Exit Full Screen","Quitter le plein écran","Salir de pantalla completa","Vollbildmodus verlassen"]
["Tool Drop Down Menu","Text Box","tool_txt1","Gantt",null,null,null,null,{"$f":"I72","v":"Tools"},{"$f":"J72","v":"Outils"},{"$f":"K72","v":"Herramientas"},{"$f":"L72","v":"Tools"}]
["Tool Drop Down Menu","Text Box","tool_txt2","Gantt",null,null,null,null,"Update Holidays","Mettre à jour congés","Actualizar vacaciones","Urlaub aktualisieren"]
["Tool Drop Down Menu","Text Box","tool_txt4","Gantt",null,null,null,null,"Update Members List","Mettre à jour membres","Actualizar lista de miembros","Benutzerliste aktualisieren"]
["Tool Drop Down Menu","Text Box","tool_txt5","Gantt",null,null,null,null,"Refresh Gantt View (CTRL+N)","Rafraîchir le diagramme (CTRL+N)","Actualizar la vista del diagrama (CTRL+N)","Diagramm Aktualisieren (STRG+N)"]
["Tool Drop Down Menu","Text Box","tool_txt6","Gantt",null,null,null,null,"Adjust Print Margins","Ajuster à l'impression","Ajustar para la impresión","Fit zu drucken"]
["Tool Drop Down Menu","Text Box","tool_txt7","Gantt",null,null,null,null,"Share by email","Partager par email","Compartir por correo electrónico","Senden Sie per E-Mail"]
["Tool Drop Down Menu","Text Box","tool_cancel","Gantt",null,null,null,null,{"$f":"I83","v":"Close"},"Fermer","Cerrar",{"$f":"L83","v":"Schließen"}]
["Help Drop Down Menu","Text Box","help_txt1","Gantt",null,null,null,null,{"$f":"I$73","v":"Help"},{"$f":"J$73","v":"Aide"},{"$f":"K$73","v":"Ayuda"},{"$f":"L$73","v":"Hilfe"}]
["Help Drop Down Menu","Text Box","help_txt2","Gantt",null,null,null,null,"To keep this file as light as possible, we invite you to access the tutorial online.","Afin de maintenir ce fichier aussi léger que possible, le tutorial peut être consulté en ligne.","Para mantener este archivo lo más ligero posible, le invitamos a  acceder al tutorial en línea.","Um den Umfang dieser Datei minimal zu halten, tutorial sind im internet einsehbar."]
["Help Drop Down Menu","Text Box","help_txt3","Gantt",null,null,null,null,"Support ","Support","Apoyo ","Support"]
["Help Drop Down Menu","Text Box","help_txt6","Gantt",null,null,null,null,"Satisfaction Survey","Enquête de satisfaction","Encuesta de Satisfacción","Zufriedenheitsumfrage "]
["Help Drop Down Menu","Text Box","help_txt7","Gantt",null,null,null,null,"Share with us your opinion about this tool.","Partagez avec nous votre opinion sur cet outil.","Comparta con nosotros su opinión sobre esta herramienta.","Teilen Sie mit uns Ihre Meinung zu diesem Tool."]
["Help Drop Down Menu","Text Box","help_cancel","Gantt",null,null,null,null,{"$f":"I$83","v":"Close"},{"$f":"J$83","v":"Fermer"},{"$f":"K83","v":"Cerrar"},{"$f":"L$83","v":"Schließen"}]
["About Drop Down Menu","Text Box","about_txt1","Gantt",null,null,null,null,{"$f":"I74","v":"About"},{"$f":"J74","v":"À propos"},{"$f":"K74","v":"Acerca de"},{"$f":"L74","v":"Über"}]
["About Drop Down Menu","Text Box","about_txt2","Gantt",null,null,null,null,"Gestion de projet automobile\ngestionprojetauto.wordpress.com\nammar.anass@yahoo.com","Gestion de projet automobile\ngestionprojetauto.wordpress.com\nammar.anass@yahoo.com","Gestion de projet automobile\ngestionprojetauto.wordpress.com\nammar.anass@yahoo.com","Gestion de projet automobile\ngestionprojetauto.wordpress.com\nammar.anass@yahoo.com"]
["About Drop Down Menu","Text Box","about_txt3","Gantt",null,null,null,null,"Copyright","Copyright","Copyright","Copyright"]
["About Drop Down Menu","Text Box","about_txt10","Gantt",null,null,null,null,"If you received this file from a third party and would like to use it for your own projects, we invite you to purchase your personal copy.","Si vous avez reçu ce fichier d'une tierce personne et souhaitez l'utiliser pour vos projets, nous vous invitons à acquérir votre copie personnelle.\n","Si ha recibido este archivo de alguien y quiere usarlo para sus propios proyectos, puede comprar su copia personal.",{"$f":"I101","v":"If you received this file from a third party and would like to use it for your own projects, we invite you to purchase your personal copy."}]
["About Drop Down Menu","Text Box","about_txt8","Gantt",null,null,null,null,{"$f":"\"You have the version \" & HideValues!M114","v":"You have the version 7.9.9 PRO (2007)"},{"$f":"\"Vous avez la version \" & HideValues!M114","v":"Vous avez la version 7.9.9 PRO (2007)"},{"$f":"\"Usted tiene la versión \" & HideValues!M114","v":"Usted tiene la versión 7.9.9 PRO (2007)"},{"$f":"\"Sie über Version \" & HideValues!M114 & \" verfügen\"","v":"Sie über Version 7.9.9 PRO (2007) verfügen"}]
["About Drop Down Menu","Text Box","about_txt9","Gantt",null,null,null,null,"Upgrade to PRO  today !","Téléchargez la version PRO !","Actualice a la versión PRO hoy","Upgrade to PRO  today !"]
["About Drop Down Menu","Text Box","about_txt5","Gantt",null,null,null,null,"More ","Plus","Más","Mehr"]
["About Drop Down Menu","Text Box","about_txt6","Gantt",null,null,null,null,"Credits: Fat Cow (fatcow.com/free-icons), Aha-soft (aha-soft.com/free-icons, Icon8 (icons8.com/). Microsoft Excel® is registered trademarks of Microsoft Corporation.","Crédits: Fat Cow (fatcow.com/free-icons), Aha-soft (aha-soft.com/free-icons, Icon8 (icons8.com/). Microsoft Excel® is registered trademarks of Microsoft Corporation.",{"$f":"I105","v":"Credits: Fat Cow (fatcow.com/free-icons), Aha-soft (aha-soft.com/free-icons, Icon8 (icons8.com/). Microsoft Excel® is registered trademarks of Microsoft Corporation."},{"$f":"I105","v":"Credits: Fat Cow (fatcow.com/free-icons), Aha-soft (aha-soft.com/free-icons, Icon8 (icons8.com/). Microsoft Excel® is registered trademarks of Microsoft Corporation."}]
["About Drop Down Menu","Text Box","about_cancel","Gantt",null,null,null,null,{"$f":"I$83","v":"Close"},{"$f":"J$83","v":"Fermer"},{"$f":"K83","v":"Cerrar"},{"$f":"L$83","v":"Schließen"}]
["Tools Sheet : Top Menu","Text Box","back_txt","Tools",null,null,null,null,"Back to Gantt Chart","Retour au diagramme de Gantt","Volver al Gantt","Zurück zur Gantt-Diagramm"]
["Tools Sheet : Holidays","Cell",null,"Tools",{"$f":"ROW(Tools!$B$9)","v":9},{"$f":"COLUMN(Tools!$B$9)","v":2},null,null,"Bank Holidays & Vacations","Jours de congé","Días feriados y vacaciones","Urlaubszeitraum"]
["Tools Sheet : Members","Cell",null,"Tools",{"$f":"ROW(Tools!$D$9)","v":9},{"$f":"COLUMN(Tools!$D$9)","v":4},null,null,"Team Members","Equipe projet","Equipo del proyecto","Projektteam"]
["Tools Sheet : Members","Cell",null,"Tools",{"$f":"ROW(Tools!$D$10)","v":10},{"$f":"COLUMN(Tools!$D$10)","v":4},null,null,"Short Name","Diminutif","Nombre corto","Kurznamen"]
["Tools Sheet : Members","Cell",null,"Tools",{"$f":"ROW(Tools!$E$10)","v":10},{"$f":"COLUMN(Tools!$E$10)","v":5},null,null,"Full Name","Nom complet","Nombre completo","Vollständiger Name"]
["Tools Sheet : Members","Cell",null,"Tools",{"$f":"ROW(Tools!$F$10)","v":10},{"$f":"COLUMN(Tools!$F$10)","v":6},null,null,"Company","Entreprise","Empresa","Unternehmen"]
["Tools Sheet : Members","Cell",null,"Tools",{"$f":"ROW(Tools!$G$10)","v":10},{"$f":"COLUMN(Tools!$G$10)","v":7},null,null,"Division","Division","División","Abteilung"]
["Tools Sheet : Members","Cell",null,"Tools",{"$f":"ROW(Tools!$I$10)","v":10},{"$f":"COLUMN(Tools!$I$10)","v":9},null,null,"Phone","Téléphone","Teléfono","Telefon"]
["HideValues : First Gantt Date","Cell",null,"HideValues",{"$f":"ROW(HideValues!$B8)","v":8},{"$f":"COLUMN(HideValues!$B8)","v":2},null,null,"January","Janvier","Enero","Januar"]
["HideValues : First Gantt Date","Cell",null,"HideValues",{"$f":"ROW(HideValues!$B9)","v":9},{"$f":"COLUMN(HideValues!$B9)","v":2},null,null,"February","Février","Febrero","Februar"]
["HideValues : First Gantt Date","Cell",null,"HideValues",{"$f":"ROW(HideValues!$B10)","v":10},{"$f":"COLUMN(HideValues!$B10)","v":2},null,null,"March","Mars","Marzo","März"]
["HideValues : First Gantt Date","Cell",null,"HideValues",{"$f":"ROW(HideValues!$B11)","v":11},{"$f":"COLUMN(HideValues!$B11)","v":2},null,null,"April","Avril","Abril","April"]
["HideValues : First Gantt Date","Cell",null,"HideValues",{"$f":"ROW(HideValues!$B12)","v":12},{"$f":"COLUMN(HideValues!$B12)","v":2},null,null,"May","Mai","Mayo","Mai"]
["HideValues : First Gantt Date","Cell",null,"HideValues",{"$f":"ROW(HideValues!$B13)","v":13},{"$f":"COLUMN(HideValues!$B13)","v":2},null,null,"June","Juin","Junio","Juni"]
["HideValues : First Gantt Date","Cell",null,"HideValues",{"$f":"ROW(HideValues!$B14)","v":14},{"$f":"COLUMN(HideValues!$B14)","v":2},null,null,"July","Juillet","Julio","Juli"]
["HideValues : First Gantt Date","Cell",null,"HideValues",{"$f":"ROW(HideValues!$B15)","v":15},{"$f":"COLUMN(HideValues!$B15)","v":2},null,null,"August","Août","Agosto","August"]
["HideValues : First Gantt Date","Cell",null,"HideValues",{"$f":"ROW(HideValues!$B16)","v":16},{"$f":"COLUMN(HideValues!$B16)","v":2},null,null,"September","Septembre","Septiembre","September"]
["HideValues : First Gantt Date","Cell",null,"HideValues",{"$f":"ROW(HideValues!$B17)","v":17},{"$f":"COLUMN(HideValues!$B17)","v":2},null,null,"October","Octobre","Octubre","Oktober"]
["HideValues : First Gantt Date","Cell",null,"HideValues",{"$f":"ROW(HideValues!$B18)","v":18},{"$f":"COLUMN(HideValues!$B18)","v":2},null,null,"November","Novembre","Noviembre","November"]
["HideValues : First Gantt Date","Cell",null,"HideValues",{"$f":"ROW(HideValues!$B19)","v":19},{"$f":"COLUMN(HideValues!$B19)","v":2},null,null,"December","Décembre","Diciembre","Dezember"]
["HideValues : Working Days","Cell",null,"HideValues",{"$f":"ROW(HideValues!$B45)","v":45},{"$f":"COLUMN(HideValues!$B45)","v":2},null,null,"Working Days Only","Jours ouvrés uniquement","Sólo días hábiles","Arbeitstage Nur"]
["HideValues : Working Days","Cell",null,"HideValues",{"$f":"ROW(HideValues!$D46)","v":46},{"$f":"COLUMN(HideValues!$B46)","v":2},null,null,"All Days","Weekend travaillé","todos los días","Alle Tage"]
["HideValues : Working Days","Cell",null,"HideValues",{"$f":"ROW(HideValues!$D45)","v":45},{"$f":"COLUMN(HideValues!$D45)","v":4},null,null,"Saturday, Sunday","Samedi, dimanche","Sábado, Domingo","Samstag, Sonntag"]
["HideValues : Working Days","Cell",null,"HideValues",{"$f":"ROW(HideValues!$D46)","v":46},{"$f":"COLUMN(HideValues!$D46)","v":4},null,null,"Sunday, Monday","Dimanche, lundi","Domingo, Lunes","Sonntag, Montag"]
["HideValues : Working Days","Cell",null,"HideValues",{"$f":"ROW(HideValues!$D47)","v":47},{"$f":"COLUMN(HideValues!$D47)","v":4},null,null,"Monday, Tuesday","Lundi, mardi","Lunes, Martes","Montag, Dienstag"]
["HideValues : Working Days","Cell",null,"HideValues",{"$f":"ROW(HideValues!$D48)","v":48},{"$f":"COLUMN(HideValues!$D48)","v":4},null,null,"Tuesday, Wednesday","Mardi, mercredi","Martes, Miércoles","Dienstag, Mittwoch"]
["HideValues : Working Days","Cell",null,"HideValues",{"$f":"ROW(HideValues!$D49)","v":49},{"$f":"COLUMN(HideValues!$D49)","v":4},null,null,"Wednesday, Thursday","Mercredi, jeudi","Miércoles, Jueves","Mittwoch, Donnerstag"]
["HideValues : Working Days","Cell",null,"HideValues",{"$f":"ROW(HideValues!$D50)","v":50},{"$f":"COLUMN(HideValues!$D50)","v":4},null,null,"Thursday, Friday","Jeudi, vendredi","Jueves, Viernes","Donnerstag, Freitag"]
["HideValues : Working Days","Cell",null,"HideValues",{"$f":"ROW(HideValues!$D51)","v":51},{"$f":"COLUMN(HideValues!$D51)","v":4},null,null,"Friday, Saturday","Vendredi, samedi","Viernes, Sábado","Freitag, Samstag"]
["HideValues : Working Days","Cell",null,"HideValues",{"$f":"ROW(HideValues!$D52)","v":52},{"$f":"COLUMN(HideValues!$D52)","v":4},null,null,"Sunday only","Dimanche uniquement","Sólo el Domingo","Sonntag nur"]
["HideValues : Working Days","Cell",null,"HideValues",{"$f":"ROW(HideValues!$D53)","v":53},{"$f":"COLUMN(HideValues!$D53)","v":4},null,null,"Monday only","Lundi uniquement","sólo de Lunes","Montag nur"]
["HideValues : Working Days","Cell",null,"HideValues",{"$f":"ROW(HideValues!$D54)","v":54},{"$f":"COLUMN(HideValues!$D54)","v":4},null,null,"Tuesday only","Mardi uniquement","Sólo el Martes","Dienstag nur"]
["HideValues : Working Days","Cell",null,"HideValues",{"$f":"ROW(HideValues!$D55)","v":55},{"$f":"COLUMN(HideValues!$D55)","v":4},null,null,"Wednesday only","Mercredi uniquement","Sólo el Miércoles","Mittwoch nur"]
["HideValues : Working Days","Cell",null,"HideValues",{"$f":"ROW(HideValues!$D56)","v":56},{"$f":"COLUMN(HideValues!$D56)","v":4},null,null,"Thursday only","Jeudi uniquement","Sólo el Jueves","Donnerstag nur"]
["HideValues : Working Days","Cell",null,"HideValues",{"$f":"ROW(HideValues!$D57)","v":57},{"$f":"COLUMN(HideValues!$D57)","v":4},null,null,"Friday only","Vendredi uniquement","Sólo el Viernes","Freitag nur"]
["HideValues : Working Days","Cell",null,"HideValues",{"$f":"ROW(HideValues!$D58)","v":58},{"$f":"COLUMN(HideValues!$D58)","v":4},null,null,"Saturday only","Samedi uniquement","Sólo el Sábado","Samstag nur"]
["HideValues : Working Days","Cell",null,"HideValues",{"$f":"ROW(HideValues!$H45)","v":45},{"$f":"COLUMN(HideValues!$H45)","v":8},null,null,"Monday (ISO 8601)","Lundi (ISO 8601)","Lunes (ISO 8601)","Montag (ISO 8601)"]
["HideValues : Working Days","Cell",null,"HideValues",{"$f":"ROW(HideValues!$H46)","v":46},{"$f":"COLUMN(HideValues!$H46)","v":8},null,null,"Monday","Lundi","Lunes","Montag"]
["HideValues : Working Days","Cell",null,"HideValues",{"$f":"ROW(HideValues!$H47)","v":47},{"$f":"COLUMN(HideValues!$H47)","v":8},null,null,"Tuesday","Mardi","Martes","Dienstag"]
["HideValues : Working Days","Cell",null,"HideValues",{"$f":"ROW(HideValues!$H48)","v":48},{"$f":"COLUMN(HideValues!$H48)","v":8},null,null,"Wednesday","Mercredi","Miércoles","Mittwoch"]
["HideValues : Working Days","Cell",null,"HideValues",{"$f":"ROW(HideValues!$H49)","v":49},{"$f":"COLUMN(HideValues!$H49)","v":8},null,null,"Thursday","Jeudi","Jueves","Donnerstag"]
["HideValues : Working Days","Cell",null,"HideValues",{"$f":"ROW(HideValues!$H50)","v":50},{"$f":"COLUMN(HideValues!$H50)","v":8},null,null,"Friday","Vendredi","Viernes","Freitag"]
["HideValues : Working Days","Cell",null,"HideValues",{"$f":"ROW(HideValues!$H51)","v":51},{"$f":"COLUMN(HideValues!$H51)","v":8},null,null,"Saturday","Samedi","Sábado","Samstag"]
["HideValues : Working Days","Cell",null,"HideValues",{"$f":"ROW(HideValues!$H52)","v":52},{"$f":"COLUMN(HideValues!$H52)","v":8},null,null,"Sunday","Dimanche","Domingo","Sonntag"]
["HideValues : VBA Budget Warning","Cell",null,"HideValues",{"$f":"ROW(HideValues!$B77)","v":77},{"$f":"COLUMN(HideValues!$B77)","v":2},null,null,"This operation will only hides the budget columns.","Cette opération ne fera que masquer les colonnes liées au budget.","Esta operación sólo oculta las columnas relacionadas con el presupuesto.","Dies wird nur Spalten in den Haushalt im Zusammenhang verstecken."]
["HideValues : VBA Budget Warning","Cell",null,"HideValues",{"$f":"ROW(HideValues!$B78)","v":78},{"$f":"COLUMN(HideValues!$B78)","v":2},null,null,"Please clear all related fields according to your confidentiality policy.","Veuillez supprimer toutes les informations sensibles afin de respecter votre politique de confidentialité interne.","Por favor, elimine toda la información sensible para cumplir con su política de privacidad interna.","Bitte entfernen Sie alle sensiblen Informationen, um Ihre internen Datenschutzbestimmungen zu erfüllen."]
["HideValues : VBA Budget Warning","Cell",null,"HideValues",{"$f":"ROW(HideValues!$B79)","v":79},{"$f":"COLUMN(HideValues!$B79)","v":2},null,null,"Confidentiality Warning","Message de confidentialité","Advertencia de privacidad","Datenschutz Nachricht"]
["HideValues : VBA Send by email","Cell",null,"HideValues",{"$f":"ROW(HideValues!$B64)","v":64},{"$f":"COLUMN(HideValues!$B80)","v":2},null,null,"Pre-fill the recipients","Pré-remplir les destinataires","Completar automaticamente los destinatarios","Pre- füllen die Empfänger"]
["HideValues : VBA Send by email","Cell",null,"HideValues",{"$f":"ROW(HideValues!$B65)","v":65},{"$f":"COLUMN(HideValues!$B81)","v":2},null,null,"Would you like to pre-fill the recipients from the Project Members List ?","Souhaiteriez-vous pré-remplir les destinataires depuis la liste des membres du projet ?","¿Quiere completar automaticamente los destinatarios de la lista de los miembros del proyecto ?","Möchten Sie vor, füllen Sie die Empfänger aus dem Projekt- Benutzerliste ?"]
["HideValues : VBA Send by email","Cell",null,"HideValues",{"$f":"ROW(HideValues!$B66)","v":66},{"$f":"COLUMN(HideValues!$B82)","v":2},null,null,"[Confidential] Latest update of project schedule","[Confidentiel ] Dernière mise à jour du planning projet","[ Confidencial ] Última actualización del cronograma del proyecto","[ Vertraulich] Letzte Aktualisierung des Projektzeitplan"]
["Language Drop Down Menu","Text Box","lang_txt1","Gantt",null,null,null,null,{"$f":"I$75","v":"Language"},{"$f":"J$75","v":"Langue"},{"$f":"K$75","v":"Idioma"},{"$f":"L$75","v":"Sprache"}]
["Language Drop Down Menu","Text Box","lang_cancel","Gantt",null,null,null,null,{"$f":"I$83","v":"Close"},{"$f":"J$83","v":"Fermer"},{"$f":"K83","v":"Cerrar"},{"$f":"L$83","v":"Schließen"}]
["Starting Date : dropdown list","Cell",null,"HideValues",{"$f":"ROW(HideValues!$A83)","v":83},{"$f":"COLUMN(HideValues!$A83)","v":1},null,null,"1- After Previous","1- Après précédente","1- Después de la anterior","1- Nach vorheriger"]
["Starting Date : dropdown list","Cell",null,"HideValues",{"$f":"ROW(HideValues!$B83)","v":83},{"$f":"COLUMN(HideValues!$B83)","v":2},null,null,"2- With Previous","2- Avec précédente","2- Con la anterior","2- Bei früheren"]
["Starting Date : dropdown list","Cell",null,"HideValues",{"$f":"ROW(HideValues!$C83)","v":83},{"$f":"COLUMN(HideValues!$C83)","v":3},null,null,"2- Manual Input","3- Saisie manuelle","3- Ingreso manual","3- Manuell"]
["Starting Date : dropdown list","Cell",null,"HideValues",{"$f":"ROW(HideValues!$E83)","v":83},{"$f":"COLUMN(HideValues!$E83)","v":5},null,null,"Help","Aide","Ayuda","Hilfe"]
["Gantt : Get Pro","Text Box","get_pro_txt1","Gantt",null,null,null,null,"Free Version","Version Gratuite","Versión gratuita","Kostenlos Version"]
["Gantt : Get Pro","Text Box","get_pro_txt2","Gantt",null,null,null,null,"This feature is not available in the free version of the Excel Gantt Chart Maker.","Cette fonctionnalité n'est pas disponible dans la version gratuite du Excel Gantt Chart Maker.","Esta característica no se ofrece en la versión gratuita del Excel Gantt Chart Maker.","Diese Funktion ist nicht verfügbar in der kostenlosen Version des Excel Gantt Chart Maker."]
["Gantt : Get Pro","Text Box","get_pro_txt3","Gantt",null,null,null,null,"Download the PRO version and discover exclusive features.","Téléchargez la version PRO et découvrez une multitudes de fonctions exclusives.","Descargue la versión PRO y descubra las características exclusivas.","Holen das PRO-Version und entdecken Sie eine vielzahl exklusiver funktionen."]
["Gantt : Get Pro","Text Box","get_pro_txt4","Gantt",null,null,null,null,{"$f":"I103","v":"Upgrade to PRO  today !"},{"$f":"J103","v":"Téléchargez la version PRO !"},{"$f":"K103","v":"Actualice a la versión PRO hoy"},{"$f":"L103","v":"Upgrade to PRO  today !"}]
["Gantt : Get Pro","Text Box","get_pro_txt5","Gantt",null,null,null,null,"Later","Plus tard","Más tarde","Später"]
["Gantt : Rows Limit","Text Box","get_pro_txt6","Gantt",null,null,null,null,"With the STARTER version, you cannot exceed 100 rows.","Avec la version STARTER, vous ne pouvez pas dépasser 100 lignes.","Con la versión beta gratuita, no puede exceder las 100 filas.","Mit der kostenlosen beta Version können Sie nicht 100 Zeilen nicht überschreiten."]
["Gantt : Rows Limit","Text Box","get_pro_txt7","Gantt",null,null,null,null,"Download the PRO version in order to remove this limitation and discover other exclusive features.","Téléchargez la version PRO pour lever cette limitation et découvrir une multitudes d'autres  fonctions exclusives.","Descargar la versión PRO con el fin de eliminar esta limitación y descubrir otras características exclusivas.","Laden Sie die PRO-Version, um diese Einschränkung zu entfernen, und andere exklusive Features entdecken."]
["Gantt : Rows Limit","Text Box","get_pro_txt8","Gantt",null,null,null,null,"Later","Plus tard","Más tarde","Später"]
["Gantt : Survey","Text Box","survey_txt2","Gantt",null,null,null,null,"Thank you for using the \"Excel Gantt Chart Maker\". As you may appreciate, we value your opinion as it help us to better understand your expectations.","Merci d'avoir opté pour \"Excel Gantt Chart Maker\". Votre avis nous est précieux car il nous permet de mieux saisir vos attentes.","Gracias por utilizar el \"Excel Gantt Chart Maker\".  Como usted opuede apreciar, nos interesa su opinión, ya que nos ayudan a entender mejor sus expectativas.",{"$f":"I171","v":"Thank you for using the \"Excel Gantt Chart Maker\". As you may appreciate, we value your opinion as it help us to better understand your expectations."}]
["Gantt : Survey","Text Box","survey_txt3","Gantt",null,null,null,null,"Please let us know what you think about this tool and how we can further improve your experience.","Dans ce but, nous espérons que vous prendrez le temps de compléter notre questionnaire en ligne.","Por favor, háganos saber lo que piensa acerca de esta herramienta y cómo podemos mejorar su experiencia.","Please let us know what you think about this tool and how we can further improve your experience."]
["Gantt : Survey","Text Box","survey_txt40","Gantt",null,null,null,null,"Start the Survey","Questionnaire en ligne","Iniciar la Encuesta","Start the Survey"]
["Gantt : Survey","Text Box","survey_txt5","Gantt",null,null,null,null,"Remind me later","Plus tard","Recordar más tarde","Remind me later"]
["Gantt : Survey","Text Box","survey_txt6","Gantt",null,null,null,null,"Never remind me again","Ne plus me demander","No me recuerden de nuevo","Never remind me again"]
["Hyper Link: About - Blog","Hyperlink","about_txt5","Gantt",null,null,null,null,"https://gestionprojetauto.wordpress.com/2010/12/09/download-free-excel-gantt-chart/","https://gestionprojetauto.wordpress.com/2010/05/28/diagramme-de-gantt-sous-excel-gratuit/",{"$f":"I176","v":"https://gestionprojetauto.wordpress.com/2010/12/09/download-free-excel-gantt-chart/"},"https://gestionprojetauto.wordpress.com/2010/12/09/download-free-excel-gantt-chart/"]
["Link to survey (from popup)","Cell","survey_txt40","HideValues",{"$f":"ROW(HideValues!$M106)","v":106},{"$f":"COLUMN(HideValues!$M106)","v":13},null,null,"http://ammaranass.polldaddy.com/s/satisfactionsurvey","http://ammaranass.polldaddy.com/s/enquete-de-satisfaction","http://ammaranass.polldaddy.com/s/satisfactionsurvey","http://ammaranass.polldaddy.com/s/satisfactionsurvey"]
["Hyper Link: Link to survey (from menu)","Hyperlink","help_txt7","Gantt",null,null,null,null,"http://ammaranass.polldaddy.com/s/satisfactionsurvey","http://ammaranass.polldaddy.com/s/enquete-de-satisfaction","http://ammaranass.polldaddy.com/s/satisfactionsurvey","http://ammaranass.polldaddy.com/s/satisfactionsurvey"]
["Hyper Link: About - Get your copy","Hyperlink","about_txt10","Gantt",null,null,null,null,{"$f":"$I$176","v":"https://gestionprojetauto.wordpress.com/2010/12/09/download-free-excel-gantt-chart/"},{"$f":"$J$176","v":"https://gestionprojetauto.wordpress.com/2010/05/28/diagramme-de-gantt-sous-excel-gratuit/"},{"$f":"I179","v":"https://gestionprojetauto.wordpress.com/2010/12/09/download-free-excel-gantt-chart/"},{"$f":"I179","v":"https://gestionprojetauto.wordpress.com/2010/12/09/download-free-excel-gantt-chart/"}]
["Hyper Link: Help - Support","Hyperlink","help_txt3","Gantt",null,null,null,null,"https://gestionprojetauto.wordpress.com/support-excel-gantt-chart-maker","https://gestionprojetauto.wordpress.com/support-diagramme-de-gantt",{"$f":"I180","v":"https://gestionprojetauto.wordpress.com/support-excel-gantt-chart-maker"},{"$f":"I180","v":"https://gestionprojetauto.wordpress.com/support-excel-gantt-chart-maker"}]
["Hyper Link: Upgrade to pro pop up - Upgrade","Hyperlink","get_pro_txt4","Gantt",null,null,null,null,{"$f":"$I$176","v":"https://gestionprojetauto.wordpress.com/2010/12/09/download-free-excel-gantt-chart/"},{"$f":"$J$176","v":"https://gestionprojetauto.wordpress.com/2010/05/28/diagramme-de-gantt-sous-excel-gratuit/"},{"$f":"I181","v":"https://gestionprojetauto.wordpress.com/2010/12/09/download-free-excel-gantt-chart/"},{"$f":"I181","v":"https://gestionprojetauto.wordpress.com/2010/12/09/download-free-excel-gantt-chart/"}]
["Hyper Link: About - Upgrade to pro","Hyperlink","about_txt9","Gantt",null,null,null,null,{"$f":"$I$176","v":"https://gestionprojetauto.wordpress.com/2010/12/09/download-free-excel-gantt-chart/"},{"$f":"$J$176","v":"https://gestionprojetauto.wordpress.com/2010/05/28/diagramme-de-gantt-sous-excel-gratuit/"},{"$f":"I182","v":"https://gestionprojetauto.wordpress.com/2010/12/09/download-free-excel-gantt-chart/"},{"$f":"I182","v":"https://gestionprojetauto.wordpress.com/2010/12/09/download-free-excel-gantt-chart/"}]
["Gantt : Add Tasks","Text Box","addtasks_button","Gantt",null,null,null,null,"ADD SUB-TASKS","AJOUTER DES TACHES","Añadir tareas","ADD AUFGABEN"]
["Gantt : Add Tasks","Text Box","addtasks5","Gantt",null,null,null,null,"Number of Rows: ","Nombre de lignes:","Número de líneas:","Anzahl der Zeilen:"]
["Gantt : Add Tasks","Text Box","addtasks6","Gantt",null,null,null,null,"Location:","Position:","Posición:","Position:"]
["Gantt : Add Tasks","Text Box","addtasks4","Gantt",null,null,null,null,"Options:","Options:","Opciones:","Optionen:"]
["Gantt : Add Tasks","Text Box","addtasks2","Gantt",null,null,null,null,"CANCEL","ANNULER","CANCELAR","ZURÜCK"]
["Gantt : Add Tasks","Text Box","addtasks1","Gantt",null,null,null,null,"ADD","AJOUTER","ADD","ADD"]
["Gantt : Add Tasks","Text Box","addtasks12","Gantt",null,null,null,null,"Below the last row","Après la dernière ligne","Después de la última línea","Nach der letzten Zeile"]
["Gantt : Add Tasks","Text Box","addtasks13","Gantt",null,null,null,null,"Below the selected row","En-dessous de la sélection","Por debajo de la selección","Unterhalb der Auswahl"]
["Gantt : Add Tasks","Text Box","addtasks14","Gantt",null,null,null,null,"Above the selected row","Au-dessus de la sélection","Por encima de la selección","Oberhalb der Auswahl"]
["Gantt : Add Tasks","Text Box","addtasks15","Gantt",null,null,null,null,"Include task header","Inclure l'en-tête","Incluir un encabezado","Include-Header"]
["Gantt : Add Tasks","Text Box","addtasks16","Gantt",null,null,null,null,"Number the sub-tasks","Numéroter la série","Numerar las sub-tareas","Anzahl der Teilaufgaben"]

{"sheet":"HideValues","index":3,"n_rows":120,"n_cols":19,"rows_kept":120,"cut":false,"hidden":true,"merged":[[117,15,117,16],[111,15,112,16],[113,15,113,16],[75,0,75,5],[117,12,118,13],[63,1,63,5],[64,1,64,5],[65,1,65,5],[109,15,109,16],[115,12,115,13],[115,15,116,16],[119,12,119,13],[13,7,13,8],[111,12,112,13],[113,12,113,13],[109,12,109,13],[88,12,88,13],[45,7,45,8],[46,7,46,8],[47,7,47,8],[48,7,48,8],[49,7,49,8],[84,12,84,13],[51,7,51,8],[53,7,53,8],[53,3,53,4],[77,1,77,5],[103,12,104,13],[105,12,106,13],[86,12,87,13],[98,12,99,13],[100,12,100,13],[101,12,101,13],[90,12,91,13],[92,12,92,13],[94,12,95,13],[96,12,96,13],[78,1,78,5],[56,0,56,1],[69,0,69,1],[76,1,76,5],[47,3,47,4],[48,3,48,4],[85,0,85,2],[81,0,81,4],[49,3,49,4],[50,3,50,4],[51,3,51,4],[59,3,59,4],[55,3,55,4],[56,3,56,4],[62,0,62,5],[58,3,58,4],[54,3,54,4],[57,3,57,4],[71,0,71,1],[52,3,52,4],[49,0,49,1],[1,7,2,8],[52,7,52,8],[43,7,43,9],[50,7,50,8],[2,0,3,0],[43,0,43,1],[11,7,12,9],[14,7,14,8],[15,7,15,8],[44,7,44,8],[16,7,16,8],[43,3,43,5],[44,3,44,4],[45,3,45,4],[46,3,46,4]]}
["Start Date And Bookmark",null,null,null,null,null,null,null,null,null,null,null,null,null,null,null,null,"USERS 1","USERS 2"]
[null,null,null,null,null,null,null,"Days to use for \"first day of Gantt\""]
["Final Value For Gantt","Red Boomark Position",{"$f":"DATE(F6,D6,C6)","v":"2016-11-15"},{"$f":"C3*1","v":"2016-11-15"}]
[null,"Gantt First day position",{"$f":"DATE(F7,D7,C7)","v":"2016-11-08"},{"$f":"IF(B61=\"Weekly\",B60*1,C4*1)","v":"2016-11-08"},null,null,null,"Today","Lowest Date"]
[null,null,null,null,null,null,null,{"$f":"TODAY()","v":"2016-05-22"},"2016-11-08"]
["linkcell","Red Boomark Position",15,11,7,{"$f":"E6+2009","v":2016},null,{"$f":"DAY(H5)","v":22},{"$f":"DAY(I5)","v":8}]
["linkcell","Gantt First day position",8,11,7,2016,null,{"$f":"MONTH(H5)","v":5},{"$f":"MONTH(I5)","v":11}]
[1,"Janvier","2001-01-01",2010,null,null,null,{"$f":"YEAR(H5)","v":2016},{"$f":"YEAR(I5)","v":2016}]
[2,"Février","2001-02-01",2011]
[3,"Mars","2001-03-01",2012]
[4,"Avril","2001-04-01",2013]
[5,"Mai","2001-05-01",2014,null,null,null,"Options for adding tasks"]
[6,"Juin","2001-06-01",2015]
[7,"Juillet","2001-07-01",2016,null,null,null,"Location add tasks",null,"Last"]
[8,"Août","2001-08-01",2017,null,null,null,"Header",null,true]
[9,"Septembre","2001-09-01",2018,null,null,null,"Quantity",null,1]
[10,"Octobre","2001-10-01",2019,null,null,null,"Number tasks",null,true]
[11,"Novembre","2001-11-01",2020]
[12,"Décembre","2001-12-01",2021]
[13,null,null,2022]
[14,null,null,2023]
[15,null,null,2024]
[16,null,null,2025]
[17,null,null,2026]
[18]
[19]
[20]
[21]
[22]
[23]
[24]
[25]
[26]
[27]
[28]
[29]
[30]
[31]
[]
[]
[]
[]
[]
["Working Days",null,null,"Week-End Days",null,null,null,"First Day of the Week"]
["Option 1","Jours ouvrés uniquement",null,"Samedi, dimanche",null,1,null,"Lundi (ISO 8601)",null,21]
["Option 2","Weekend travaillé",null,"Dimanche, lundi",null,2,null,"Lundi",null,11]
["LinkCell",1,null,"Lundi, mardi",null,3,null,"Mardi",null,12]
["Boolean for week days or not",{"$f":"IF(B47=1,1,0)","v":1},null,"Mardi, mercredi",null,4,null,"Mercredi",null,13]
[null,null,null,"Mercredi, jeudi",null,5,null,"Jeudi",null,14]
["Weeks Name",null,null,"Jeudi, vendredi",null,6,null,"Vendredi",null,15]
["Option 1","CW",null,"Vendredi, samedi",null,7,null,"Samedi",null,16]
["Option 2","W",null,"Dimanche uniquement",null,11,null,"Dimanche",null,17]
["Option 3","S",null,"Lundi uniquement",null,12,null,"LinkCell",null,1]
["LinkCell",3,null,"Mardi uniquement",null,13,null,"Value",null,{"$f":"OFFSET(J45,J53-1,0)","v":21}]
["Actual Prefix",{"$f":"INDIRECT(\"B\"&B54+50)","v":"S"},null,"Mercredi uniquement",null,14]
[null,null,null,"Jeudi uniquement",null,15]
["Set-up weekly",null,null,"Vendredi uniquement",null,16]
["Date originale",{"$f":"C4","v":"2016-11-08"},null,"Samedi uniquement",null,17]
["Jour",{"$f":"WEEKDAY(B58,2)","v":2},null,"LinkCell",null,1]
["Debut de semaine",{"$f":"B58-B59+1","v":"2016-11-07"},null,"Value",null,{"$f":"OFFSET(F45,F59-1,0)","v":1}]
["Show Weekly","Daily"]
[]
["Send By Email Warning Message (VBA)"]
["Tile","Pré-remplir les destinataires"]
["Warning","Souhaiteriez-vous pré-remplir les destinataires depuis la liste des membres du projet ?"]
["Email Subject","[Confidentiel ] Dernière mise à jour du planning projet"]
[]
[]
[]
["Optional Columns"]
[true,"Show Budget"]
["Empty"]
[true,"Show Comments"]
[true,"Reminder for macros"]
[]
["Budget Warning Message (VBA)"]
["Line 1","Cette opération ne fera que masquer les colonnes liées au budget."]
["Line 2","Veuillez supprimer toutes les informations sensibles afin de respecter votre politique de confidentialité interne."]
["Title","Message de confidentialité"]
[]
[]
["Support Pick A Date"]
["1- Après précédente","2- Avec précédente","3- Saisie manuelle",null,"Aide"]
[]
[null,null,null,null,null,null,null,null,null,null,null,null,"Fields for Survey"]
["Pictures to adapt between PC and MAC"]
["Sheet","PC","MAC",null,null,null,null,null,null,null,null,null,"First Time Tag"]
["Gantt","PC-start","mac-start"]
["Gantt","PC-bookmark","mac-bookmark",null,null,null,null,null,null,null,null,null,1]
["Gantt","PC-today","mac-today"]
["Gantt","PC-auto","mac-auto",null,null,null,null,null,null,null,null,null,"First Time Used"]
["Gantt","PC-workingdays","mac-workingdays"]
["Gantt","PC-weeksymbol","mac-weeksymbol"]
["Gantt","PC-optional","mac-optional"]
["Gantt","PC-title","mac-title",null,null,null,null,null,null,null,null,null,"Counter"]
["Gantt","PC-view","mac-view"]
["Gantt","PC-tools","mac-tools"]
["Gantt","PC-languages","mac-languages"]
["Gantt","PC-help","mac-help",null,null,null,null,null,null,null,null,null,"Prompt Survey"]
["Gantt","PC-about","mac-about"]
["Tools","PC-back","mac-back",null,null,null,null,null,null,null,null,"Target date"]
["Tools","PC-vacations","mac-vacations",null,null,null,null,null,null,null,null,"Status"]
["Tools","PC-team","mac-team"]
["Start","PC-macro","mac-macro",null,null,null,null,null,null,null,null,null,"Lien vers survey"]
["Start","PC-start","mac-start"]
[null,null,null,null,null,null,null,null,null,null,null,null,"http://ammaranass.polldaddy.com/s/enquete-de-satisfaction"]
[]
[]
[]
[null,null,null,null,null,null,null,null,null,null,null,null,"Version",null,null,"Note interne"]
[]
[null,null,null,null,null,null,null,null,null,null,null,null,"Version",null,null,"Build"]
[]
[null,null,null,null,null,null,null,null,null,null,null,null,"7.9.9 PRO (2007)",null,null,"7.9.9 (v.2007)"]
[]
[null,null,null,null,null,null,null,null,null,null,null,null,"Simulate MAC",null,null,"Date"]
[]
[null,null,null,null,null,null,null,null,null,null,null,null,"MAC = 1\nPC or AUTO = 0",null,null,"2016-05-22"]
[]
[null,null,null,null,null,null,null,null,null,null,null,null,0]

{"sheet":"Start","index":4,"n_rows":0,"n_cols":0,"rows_kept":0,"cut":false,"hidden":false,"merged":[]}

{"sheet":"Introduction","index":5,"n_rows":0,"n_cols":0,"rows_kept":0,"cut":false,"hidden":true,"merged":[]}